{"text_format":"1","workbook":"xlsx","n_sheets":8,"sheets":["Sheet1","MOI DRY FIT IMPERIAL","DataBase","MOI DRY FIT METRIC","PRINT","SWC","Collection","Sheet2"],"not_rendered":{"charts":2,"images":7,"macros":1,"external_links":0,"defined_names":8,"comments":4,"pivot_tables":0},"unopened":[],"bounds":{"document_bytes":16777216,"sheet_cells":100000,"rows_first":2000,"rows_last":500,"rows_between":2000,"halvings":0,"cell_chars":16384,"cell_head_chars":4096},"cells_cut":0,"cells_raw":0,"read":"whole","date_system":"1900"}

{"sheet":"Sheet1","index":0,"n_rows":114,"n_cols":32,"rows_kept":114,"cut":false,"hidden":true,"merged":[[17,18,18,18],[17,1,18,1],[17,8,18,8],[17,9,18,9],[17,10,18,10],[17,11,18,11],[17,12,18,12],[17,7,18,7],[17,6,18,6],[17,5,18,5],[17,4,18,4],[17,3,18,3],[17,17,18,17],[17,2,18,2],[17,13,18,13],[17,14,18,14],[1,7,1,18],[11,4,11,5],[12,4,12,5],[11,1,11,3],[12,1,12,3],[7,1,7,3],[7,4,7,5],[9,1,9,3],[4,1,4,3],[10,1,10,3],[1,1,1,5],[6,1,6,3],[9,4,9,5],[4,4,4,5],[10,4,10,5],[12,10,12,13],[3,1,3,5],[17,15,18,15],[17,16,18,16],[5,1,5,3],[5,4,6,5],[15,1,16,7],[8,1,8,5],[10,11,10,12],[11,11,11,12]]}
[]
[null,"PREFERED FRACTIONS ON CHART",null,null,null,null,null,"Butt to tip correction due to choice of tip wgt - mm is tip WGT lenght as millimeter"]
[]
[null,"SET UP - BASIC CLUB SPECS",null,null,null,null,2,"Grams",0,1,2,3,4,5,6,7,8,9,10]
[null,"Grip Butt cap thickness",null,null,0.125,null,null," mm",0,{"$f":"AD30","v":3.9809523809523806},{"$f":"AD29","v":5.742857142857142},{"$f":"AD28","v":8.3368421052631572},{"$f":"AD27","v":10.933333333333335},{"$f":"AD26","v":13.531034482758622},{"$f":"AD25","v":16.129411764705882},{"$f":"AD24","v":18.728205128205133},{"$f":"AD23","v":21.225000000000001},{"$f":"AD22","v":23.9265306122449},{"$f":"AD21","v":26.326530612244898}]
[null,"LENGTH between clubs ",null,null,0.375,null,null,{"$f":"LOOKUP(I13,I4:R4,I7:R7)","v":0.19904761904761903}]
[null,"(1W-9W)-(H1-H7)-(#3-#9)",null,null,null,null,null,"BT corr",0,{"$f":"(J5/2)/10","v":0.19904761904761903},{"$f":"(K5/2)/10","v":0.28714285714285709},0.41684210526315785,0.54666666666666675,0.67655172413793108,0.80647058823529405,0.93641025641025666,1.06125,1.196326530612245,1.3163265306122449]
[null,"LENGTH BETWEEN WEDGES",null,null,0.25]
[null,"CLUB IN WORK - GREEN CLUB ON THE CHART"]
[null,"BBGM-Bottom of bore to Ground.",null,null,1.25,null,null,null,".((LENGTH cm x LENGTH cm)*1)/1000"]
[null,"Play Length longest             /GREEN club in work",null,null,39.125,null,null,"MOI points pr gram at this play lenght",null,null,null,{"$f":"((H20*H20)*1)/1000","v":9.2166628690617909},null,"Points pr.Gram"]
[null,"MOI points to ADD                          to the GREEN CLUB",null,null,25,null,null,"Grams pr MOI point at this play lenght",null,null,null,{"$f":"L11/100","v":9.2166628690617911E-2},null,"Gram pr. Point"]
[null,". =NEEDED WEIGTH IN GRAMS",null,null,{"$f":"E12/L11","v":2.7124785136623828},null,null,"Grams",1,1,"LIGHTEST TIP WGT - TIP W PROGRESSION"]
[]
[]
{"$rows_left_out":100}
{"sheet":"MOI DRY FIT IMPERIAL","index":1,"n_rows":118,"n_cols":33,"rows_kept":118,"cut":false,"hidden":true,"merged":[[17,17,18,17],[17,18,18,18],[17,19,18,19],[17,1,18,1],[17,9,18,9],[17,10,18,10],[17,11,18,11],[17,12,18,12],[12,11,12,13],[12,14,12,16],[17,13,18,13],[17,14,18,14],[17,2,18,2],[17,3,18,3],[17,4,18,4],[17,5,18,5],[17,6,18,6],[17,7,18,7],[17,8,18,8],[17,15,18,15],[17,16,18,16],[1,2,1,6],[2,8,2,19],[3,2,3,6],[4,2,4,4],[4,5,4,6],[5,5,6,6],[15,1,16,3],[15,4,16,4],[15,5,16,8],[5,2,6,4],[7,2,7,4],[7,5,7,6],[8,2,8,6],[9,2,9,4],[9,5,9,6],[11,2,11,4],[11,5,11,6],[12,2,12,4],[12,5,12,6],[10,2,10,4],[10,5,10,6]]}
[null,null,null,null,null,null,1,null,0]
[null,null,"PREFERED FRACTIONS ON CHART",null,null,null,null,null,"DIM CHART"]
[null,null,"1/8\"","1/16\"","1/32\"","1,00\""]
[null,null,"BASIC CLUB SPEC SET UP",null,null,null,null,null,"1W","2W","3W","4W","5W","7W","H1","H2","H3","H4","H5","H6"]
[null,null,"Grip Butt cap thickness",null,null,0.125,null,null,44,43.25,42.75,42.25,41.75,40.75,{"$f":"I7+1.25","v":40.75},40.25,39.75,39.25,38.75,38.25]
[null,null,"LENGTH between clubs ",null,null,0.375,null,null,"#2","#3","#4","#5","#6","#7","#8","#9","PW","GW","SW","LW"]
[null,null,null,null,null,null,null,null,{"$f":"DataBase!M8+39.5","v":39.5},{"$f":"I7-0.5","v":39},{"$f":"J7-0.5","v":38.5},38,37.5,37,36.5,36,{"$f":"P7-0.25","v":35.75},{"$f":"Q7-0.25","v":35.5},{"$f":"R7-0.25","v":35.25},{"$f":"S7-0.25","v":35}]
[null,null,"LENGTH BETWEEN WEDGES",null,null,0.375,null,null,"SUGGEST",{"$f":"C20","v":39.375},{"$f":"C21","v":39},{"$f":"C22","v":38.625},{"$f":"C23","v":38.25},{"$f":"C24","v":37.875},{"$f":"C25","v":37.5},{"$f":"C26","v":37.125},{"$f":"C27","v":36.75},{"$f":"C28","v":36.375},{"$f":"C29","v":36},{"$f":"C30","v":35.625}]
[null,null,"CLUB IN WORK - GREEN CLUB ON THE CHART",null,null,null,null,null,"DIFFERENCE",{"$f":"J8-J7","v":0.375},{"$f":"K8-K7","v":0.5},0.625,0.75,0.875,1,1.125,1,0.875,0.75,0.625]
[null,null,"BBGM-Bottom of bore to Ground.",null,null,1.25]
[null,null,"Play Length GREEN club in work",null,null,39.375,null,null,"  "," "," "," "," ",null,null,null,"MOI PROG",1.33,1]
[null,null,"MOI-P TO ADD-GREEN CLUB",null,null,10,null,null," "," "," "," "," ",null,null,null,"MOI PR.MM",null,{"$f":"R11/S11","v":1.33}]
[null,null,". =NEEDED WEIGTH IN GRAMS",null,null,{"$f":"F12/R13","v":1.0707784923696182},null,null,"Grams",1,1,"LIGHTEST TIP W.-TIP W PROG.",null,null,"MOI points pr gram at this lenght",null,null,{"$f":"((I20*I20)*1)/1000","v":9.3389996822500017},"Gr.MOI-P",{"$f":"R13/100","v":9.3389996822500015E-2}]
[]
[]
{"$rows_left_out":104}
{"sheet":"DataBase","index":2,"n_rows":24,"n_cols":14,"rows_kept":24,"cut":false,"hidden":true,"merged":[[1,1,1,12],[8,0,9,4]]}
[]
[null,"TIP WEIGHT SPECS"]
[null,0,1,2,3,4,5,6,7,8,9,10,"Grams"]
[null,0,3.98,5.74,8.3000000000000007,10.9,13.5,16.100000000000001,18.7,21.2,23.9,26.3," mm"]
[null,null,null,null,null,null,null,null,null,null,null,null,{"$f":"LOOKUP('MOI DRY FIT METRIC'!J17,B3:K3,B6:K6)","v":0.41500000000000004},"Formula error"]
[null,0,{"$f":"(C4/2)/10","v":0.19900000000000001},0.28700000000000003,0.41500000000000004,0.54500000000000004,0.67500000000000004,0.80500000000000005,0.93499999999999994,1.06,1.1949999999999998,1.3149999999999999,"BT corr"]
[]
[]
["SW PROGRESSION PR INCH"]
[]
["MOI - 1.33 SWP / INCH",1.32,1,1,{"$f":"LOOKUP(D11,C11:C24,B11:B24)","v":1.32}]
["1.2 SWP / INCH",{"$f":"1.2","v":1.2},{"$f":"C11+1","v":2}]
["1.1 SWP / INCH",{"$f":"B12-0.1","v":1.0999999999999999},{"$f":"C12+1","v":3}]
["DIY - 1.0 SWP / INCH",{"$f":"B13-0.1","v":0.99999999999999989},4]
["0.9 SWP / INCH",0.89999999999999991,5]
{"$rows_left_out":10}
{"sheet":"MOI DRY FIT METRIC","index":3,"n_rows":112,"n_cols":37,"rows_kept":112,"cut":false,"hidden":false,"merged":[[93,13,93,15],[94,13,94,15],[85,2,85,4],[105,6,105,8],[104,6,104,8],[96,6,96,8],[97,6,97,8],[91,2,91,4],[92,2,92,4],[87,3,87,4],[87,9,87,11],[87,13,87,14],[74,6,74,7],[75,6,75,7],[76,6,76,7],[77,6,77,7],[78,6,78,7],[79,6,79,7],[80,6,80,7],[93,4,93,5],[93,1,93,2],[88,1,89,1],[88,2,89,4],[88,5,89,5],[90,2,90,4],[106,6,106,8],[103,6,103,19],[109,1,109,5],[109,6,109,8],[110,1,110,5],[110,6,110,8],[98,6,98,8],[107,1,107,5],[107,6,107,8],[108,1,108,5],[108,6,108,8],[101,7,101,8],[102,6,102,8],[99,6,99,8],[100,7,100,8],[87,16,87,17],[86,2,86,4],[0,12,0,15],[58,6,58,7],[59,6,59,7],[60,6,60,7],[6,2,6,4],[8,3,8,4],[37,6,37,7],[47,6,47,8],[48,6,48,8],[49,6,49,8],[7,2,7,4],[11,2,11,4],[18,1,19,3],[81,6,81,7],[72,6,72,7],[73,6,73,7],[69,6,69,7],[70,6,70,7],[71,6,71,7],[66,6,66,7],[61,6,61,7],[62,6,62,7],[67,6,67,7],[68,6,68,7],[5,9,5,11],[5,13,5,14],[5,16,5,17],[47,1,47,2],[48,1,48,2],[35,6,35,8],[49,1,49,2],[40,7,40,8],[41,6,41,8],[18,6,19,8],[46,1,46,5],[46,6,46,8],[9,5,10,5],[38,6,38,8],[36,6,36,8],[18,4,19,4],[9,2,10,4],[18,5,19,5],[9,1,10,1],[12,2,12,4],[15,2,15,4],[16,2,16,4],[16,5,16,6],[13,2,13,4],[12,5,12,6],[63,6,63,7],[64,6,64,7],[65,6,65,7],[56,6,56,8],[55,6,55,8],[16,14,16,16],[16,11,16,13],[45,6,45,8],[42,6,42,19],[47,3,47,4],[14,15,14,19],[33,15,33,19],[39,6,39,8],[48,3,48,4],[49,3,49,4],[43,6,43,8],[44,6,44,8]]}
[null,null,null,null,null,null,null,null,null,null,null,null,"SW TUNER",null,null,null,{"$f":"IF(Q2 <>1000,(Q2-1000)/10,\"0\")","v":"0"},{"$f":"IF(R2 <>1000,(R2-1000)/10,\"0\")","v":"0"},{"$f":"IF(S2 <>1000,(S2-1000)/10,\"0\")","v":"0"},{"$f":"IF(T2 <>1000,(T2-1000)/10,\"0\")","v":"0"}]
[null,null,"PLAY LENGTH",null,"BAL.POINT ","TOTAL",null,"WEDGE",null,"#3 IRON","WEDGE","IRON",35.869999999999997,null,null,null,1000,1000,1000,1000]
[null,"FRACTION","INDEX",null,"SPINNER","SPINNER",null,"MOI",null,"PLAY MM","L - DIFF","L - DIFF",null,null,1000,null,1000,1000,1000,1000]
[null,1,13,null,7390,4116,5,true,null,924,63,95,null,null,30,{"$f":"O4/10","v":3},{"$f":"IF(Q3<>1000,(Q3/20)-50,\"0\")","v":"0"},{"$f":"IF(R3<>1000,(R3/20)-50,\"0\")","v":"0"},"0","0"]
[]
[null,null,"1/8\"","1/16\"","1/32\"","1,00\"",null,null,"NAME",null,null,null,"HEADS",null,null,"SHAFTS",null,null,"SET UP",null," gw"]
[]
[null,{"$f":"F8/25.4","v":0.12598425196850396},"GRIP CAP THICKNESS",null,null,3.2,null,null,"inch",{"$f":"J10/25.4","v":0.4375},{"$f":"K10/25.4","v":0.40625},0.37499999999999994,0.34375,0.3125,0.28125,0.25,0.21875,0.18749999999999997,0.15625,{"$f":"T10/25.4","v":0.125},null,null,null,null,null,null,null,null,null,null,null,null,null,null,null,null,25]
[null,{"$f":"F9/25.4","v":1.2519685039370079},{"$f":"G9/25.4","v":1.6259842519685039},"BBGM - IRON - WEDGE",null,31.8,41.3,null,"inch",0.4375,0.40625,0.375,0.34375,0.3125,0.28125,0.25,0.21875,0.1875,0.15625,0.125]
[null,{"$f":"F10/25.4","v":0.37401574803149606},"LENGTH BETWEEN IRONS",null,null,{"$f":"L4/10","v":9.5},null,null,"INCH/MM",{"$f":"J9*25.4","v":11.112499999999999},{"$f":"K9*25.4","v":10.31875},9.5249999999999986,8.7312499999999993,7.9375,7.1437499999999998,6.35,5.5562499999999995,4.7624999999999993,3.96875,3.1749999999999998]
[null,null,null,null,null,null,null,null,"#2","#3","#4","#5","#6","#7","#8","#9",{"$f":"IF(Q2=1000,\"PW\",Q1)","v":"PW"},{"$f":"IF(R2=1000,\"GW\",R1)","v":"GW"},{"$f":"IF(S2=1000,\"SW\",S1)","v":"SW"},{"$f":"IF(T2=1000,\"LW\",T1)","v":"LW"}]
[null,{"$f":"F12/25.4","v":0.24803149606299213},"LENGTH BETWEEN WEDGES",null,null,{"$f":"K4/10","v":6.3},null,null,{"$f":"PRINT!I6","v":0.5},{"$f":"39+F61","v":39.5},{"$f":"J12-0.5","v":39},38.5,38,37.5,37,36.5,{"$f":"P12-0.25","v":36.25},{"$f":"Q12-0.25","v":36},{"$f":"R12-0.25","v":35.75},{"$f":"S12-0.25","v":35.5}]
[null,"IMPERIAL",null,null,null,"#8 IRON - METRIC",null,null,"THIS SET",{"$f":"C22/2.54","v":38.248031496063},{"$f":"C23/2.54","v":37.874015748031503},{"$f":"C24/2.54","v":37.500000000000007},{"$f":"C25/2.54","v":37.125984251968511},{"$f":"C26/2.54","v":36.751968503937007},{"$f":"C27/2.54","v":36.377952755905511},{"$f":"C28/2.54","v":36.003937007874015},{"$f":"(C29)/2.54","v":35.755905511811029},{"$f":"(C30)/2.54","v":35.507874015748037},{"$f":"(C31)/2.54","v":35.259842519685044},{"$f":"(C32)/2.54","v":35.011811023622052}]
[null,{"$f":"F14/2.54","v":36.377952755905511},null,null,null,{"$f":"J4/10","v":92.4},null,null,"DIFF",{"$f":"J13-J12","v":-1.2519685039370003},-1.1259842519684966,-0.99999999999999289,-0.87401574803148918,-0.74803149606299257,-0.62204724409448886,-0.49606299212598515,-0.49409448818897062,-0.49212598425196319,-0.49015748031495576,-0.48818897637794834]
[null,null,"IRONS SWP","STD.SW","WEDGE SWP",null,null,null,null,null,null,null,null,null,null,"WEDGE PLAY LENGTH TUNER"]
{"$rows_left_out":98}
{"sheet":"PRINT","index":4,"n_rows":70,"n_cols":43,"rows_kept":70,"cut":false,"hidden":true,"merged":[[9,2,9,4],[1,2,1,6],[2,9,2,11],[2,13,2,14],[2,16,2,17],[3,2,3,6],[4,2,4,4],[4,5,4,6],[5,2,6,4],[5,5,6,6],[7,2,7,4],[7,5,7,6],[8,2,8,6],[10,2,10,4],[10,5,10,6],[11,2,11,4],[11,5,11,6],[12,2,12,4],[12,5,12,6],[12,11,12,13],[12,14,12,16],[15,1,16,3],[15,4,16,4],[15,5,16,5],[15,6,16,8],[49,6,49,7],[41,1,41,5],[42,1,42,6],[43,1,43,6],[44,1,44,6],[46,6,46,7],[47,6,47,7],[48,6,48,7],[60,6,60,7],[61,6,61,7],[50,6,50,7],[51,6,51,7],[52,6,52,7],[53,6,53,7],[54,6,54,7],[55,6,55,7],[56,6,56,7],[57,6,57,7],[58,6,58,7],[59,6,59,7],[68,6,68,7],[69,6,69,7],[62,6,62,7],[63,6,63,7],[64,6,64,7],[65,6,65,7],[66,6,66,7],[67,6,67,7]]}
[null,null,null,null,null,null,5,null,1]
[]
[null,null,"1/8\"","1/16\"","1/32\"","1,00\"",null,null,"NAME","HOWARD JONES",null,null,"HEADS","CALLAWAY DIABLO F.",null,"SHAFTS","SS FCM GRAPHITE",null,"SET UP","6-PW",null,null,null,null,null,null,null,null,null,null,null,null,null,null,null,null,0.5,25.4]
[]
[null,null,"GRIP CAP THICK",null,null,{"$f":"'MOI DRY FIT METRIC'!F8:G8","v":3.2},null,null,"PLAY L.","#3","#4","#5","#6","#7","#8","#9","PW","GW","SW","LW",null,null,null,null,null,null,null,null,null,null,null,null,null,null,null,null,null,null,null,null,null,null,25]
[null,null,"MILLIMETER BETW.CLUBS",null,null,{"$f":"'MOI DRY FIT METRIC'!F11:G11","v":0},null,null,{"$f":"'MOI DRY FIT METRIC'!F61","v":0.5},{"$f":"'MOI DRY FIT METRIC'!J12","v":39.5},{"$f":"'MOI DRY FIT METRIC'!K12","v":39},{"$f":"'MOI DRY FIT METRIC'!L12","v":38.5},{"$f":"'MOI DRY FIT METRIC'!M12","v":38},{"$f":"'MOI DRY FIT METRIC'!N12","v":37.5},{"$f":"'MOI DRY FIT METRIC'!O12","v":37},{"$f":"'MOI DRY FIT METRIC'!P12","v":36.5},{"$f":"'MOI DRY FIT METRIC'!Q12","v":36.25},{"$f":"'MOI DRY FIT METRIC'!R12","v":36},{"$f":"'MOI DRY FIT METRIC'!S12","v":35.75},{"$f":"'MOI DRY FIT METRIC'!T12","v":35.5}]
[null,null,null,null,null,null,null,null,"SUGGEST",{"$f":"'MOI DRY FIT METRIC'!J13","v":38.248031496063},{"$f":"'MOI DRY FIT METRIC'!K13","v":37.874015748031503},{"$f":"'MOI DRY FIT METRIC'!L13","v":37.500000000000007},{"$f":"'MOI DRY FIT METRIC'!M13","v":37.125984251968511},{"$f":"'MOI DRY FIT METRIC'!N13","v":36.751968503937007},{"$f":"'MOI DRY FIT METRIC'!O13","v":36.377952755905511},{"$f":"'MOI DRY FIT METRIC'!P13","v":36.003937007874015},{"$f":"'MOI DRY FIT METRIC'!Q13","v":35.755905511811029},{"$f":"'MOI DRY FIT METRIC'!R13","v":35.507874015748037},{"$f":"'MOI DRY FIT METRIC'!S13","v":35.259842519685044},{"$f":"'MOI DRY FIT METRIC'!T13","v":35.011811023622052}]
[null,null,"LENGTH BETW WEDGES",null,null,{"$f":"'MOI DRY FIT METRIC'!F12:G12","v":6.3},null,null,"DIFF",{"$f":"'MOI DRY FIT METRIC'!J14","v":-1.2519685039370003},{"$f":"'MOI DRY FIT METRIC'!K14","v":-1.1259842519684966},{"$f":"'MOI DRY FIT METRIC'!L14","v":-0.99999999999999289},{"$f":"'MOI DRY FIT METRIC'!M14","v":-0.87401574803148918},{"$f":"'MOI DRY FIT METRIC'!N14","v":-0.74803149606299257},{"$f":"'MOI DRY FIT METRIC'!O14","v":-0.62204724409448886},{"$f":"'MOI DRY FIT METRIC'!P14","v":-0.49606299212598515},{"$f":"'MOI DRY FIT METRIC'!Q14","v":-0.49409448818897062},{"$f":"'MOI DRY FIT METRIC'!R14","v":-0.49212598425196319},{"$f":"'MOI DRY FIT METRIC'!S14","v":-0.49015748031495576},{"$f":"'MOI DRY FIT METRIC'!T14","v":-0.48818897637794834}]
[null,null,null,null,null,null,null,null,null,{"$f":"J8*25.4","v":-31.799999999999805},-28.599999999999813,-25.399999999999817,-22.199999999999825,-19.000000000000011,-15.800000000000017,-12.600000000000023,-12.549999999999853,-12.499999999999865,-12.449999999999875,-12.399999999999887]
[null,null,"BBGM",null,null,{"$f":"'MOI DRY FIT METRIC'!F9","v":31.8},{"$f":"'MOI DRY FIT METRIC'!G9","v":41.3}]
[null,null,"#3 IRON PLAY LENGTH",null,null,{"$f":"'MOI DRY FIT METRIC'!F14:G14","v":92.4}]
[null,null,"MOI-P TO ADD-GREEN CLUB",null,null,9]
[null,null,". =NEEDED WEIGTH IN GRAMS",null,null,{"$f":"F12/R13","v":0.37948176817668233},null,null,"Grams",1,0.1,"LIGHTEST TIP W.-TIP W PROG.",null,null,"MOI points pr gram at this lenght",null,null,{"$f":"((AH19*AH19)*1)/1000","v":23.716554403240011},"Gr.MOI-P",{"$f":"R13/100","v":0.23716554403240012}]
[]
[]
{"$rows_left_out":56}
{"sheet":"SWC","index":5,"n_rows":703,"n_cols":10,"rows_kept":703,"cut":false,"hidden":true,"merged":[]}
[]
[null,"#","SW","GRAM","BALANCE POINT","GRAM*(BP-14\")","SW INDEX"]
[null,"#3",{"$f":"VLOOKUP(G3,$I$3:$J$703,2)","v":"D3.1"},{"$f":"'MOI DRY FIT METRIC'!J48","v":421},{"$f":"('MOI DRY FIT METRIC'!J49/2.54)","v":28.740157480314959},{"$f":"D3*(E3-14)","v":6205.6062992125981},{"$f":"(F3*0.03528 - 143.5) /1.75","v":43.105022992125974},null,10,"A0.0"]
[null,"#4",{"$f":"VLOOKUP(G4,$I$3:$J$703,2)","v":"D3.4"},{"$f":"'MOI DRY FIT METRIC'!K$48","v":428},{"$f":"('MOI DRY FIT METRIC'!K49/2.54)","v":28.543307086614174},6224.5354330708669,43.486634330708675,null,10.1,"A0.1"]
[null,"#5",{"$f":"VLOOKUP(G5,$I$3:$J$703,2)","v":"D3.2"},{"$f":"'MOI DRY FIT METRIC'!L$48","v":433},{"$f":"('MOI DRY FIT METRIC'!L49)/2.54","v":28.346456692913385},6212.0157480314956,43.234237480314945,null,10.199999999999999,"A0.2"]
[null,"#6","D3.2",{"$f":"'MOI DRY FIT METRIC'!M$48","v":439},{"$f":"'MOI DRY FIT METRIC'!M49/2.54","v":28.149606299212596},6211.6771653543301,43.227411653543285,null,10.3,"A0.3"]
[null,"#7","D3.1",{"$f":"'MOI DRY FIT METRIC'!N$48","v":445},{"$f":"'MOI DRY FIT METRIC'!N49/2.54","v":27.952755905511811},6208.9763779527557,43.172963779527549,null,10.4,"A0.4"]
[null,"#8","D3.0",{"$f":"'MOI DRY FIT METRIC'!O$48","v":451},{"$f":"'MOI DRY FIT METRIC'!O49/2.54","v":27.755905511811022},6203.9133858267714,43.070893858267709,null,10.5,"A0.5"]
[null,"#9","D2.9",{"$f":"'MOI DRY FIT METRIC'!P$48","v":457},{"$f":"'MOI DRY FIT METRIC'!P49/2.54","v":27.559055118110237},6196.4881889763783,42.921201889763779,null,10.6,"A0.6"]
[null,"PW","D3.5",{"$f":"'MOI DRY FIT METRIC'!Q$48","v":466},{"$f":"'MOI DRY FIT METRIC'!Q49/2.54","v":27.362204724409448},6226.787401574803,43.532034015748017,null,10.7,"A0.7"]
[null,"GW","D3.2",{"$f":"'MOI DRY FIT METRIC'!R$48","v":472},{"$f":"'MOI DRY FIT METRIC'!R49/2.54","v":27.165354330708659},6214.0472440944868,43.275192440944856,null,10.8,"A0.8"]
[null,"SW","D4.8",{"$f":"'MOI DRY FIT METRIC'!S$48","v":478},{"$f":"'MOI DRY FIT METRIC'!S49/2.54","v":27.165354330708659},6293.039370078739,44.867673700787385,null,10.9,"A0.9"]
[null,"LW","D5.3",{"$f":"'MOI DRY FIT METRIC'!T$48","v":480},{"$f":"'MOI DRY FIT METRIC'!T49/2.54","v":27.165354330708659},{"$f":"D13*(E13-14)","v":6319.3700787401567},{"$f":"(F13*0.03528 - 143.5) /1.75","v":45.398500787401545},null,11,"A1.0"]
[null,"x","D3.2",{"$f":"'MOI DRY FIT METRIC'!D48","v":338.2},{"$f":"'MOI DRY FIT METRIC'!D49/2.54","v":32.374015748031496},{"$f":"D14*(E14-14)","v":6214.0921259842517},{"$f":"(F14*0.03528 - 143.5) /1.75","v":43.276097259842508},null,11.1,"A1.1"]
["T","x",{"$f":"VLOOKUP(G15,$I$3:$J$703,2)","v":{"$error":"#REF!"}},{"$f":"#REF!","v":{"$error":"#REF!"}},{"$f":"#REF!/2.54","v":{"$error":"#REF!"}},{"$f":"D15*(E15-14)","v":{"$error":"#REF!"}},{"$f":"(F15*0.03528 - 143.5) /1.75","v":{"$error":"#REF!"}},null,11.2,"A1.2"]
{"$rows_left_out":689}
{"sheet":"Collection","index":6,"n_rows":124,"n_cols":35,"rows_kept":124,"cut":false,"hidden":true,"merged":[[64,14,64,23],[65,14,65,16],[74,14,74,19],[75,14,75,16],[64,25,64,34],[65,25,65,27],[74,25,74,34],[75,25,75,27],[44,14,44,23],[45,14,45,16],[54,14,54,19],[55,14,55,16],[44,25,44,34],[45,25,45,27],[54,25,54,34],[55,25,55,27],[123,3,123,4],[84,3,84,12],[85,3,85,5],[95,3,95,5],[122,3,122,4],[116,3,116,5],[94,3,94,12],[120,3,120,4],[121,3,121,4],[115,3,115,12],[117,3,117,4],[118,3,118,4],[119,3,119,4],[44,3,44,12],[45,3,45,5],[74,3,74,12],[75,3,75,5],[23,3,23,5],[55,3,55,5],[54,3,54,8],[33,3,33,12],[34,3,34,5],[42,3,42,12],[64,3,64,12],[65,3,65,5],[14,3,14,5],[24,3,24,5],[13,3,13,10],[21,3,21,4],[19,3,19,4],[20,3,20,4],[16,3,16,4],[17,3,17,4],[18,3,18,4],[15,3,15,4]]}
[]
[]
[]
[]
[]
[]
[]
[]
[]
[]
[]
[]
[]
[null,null,null,"USE THE #8 IRON AS JUDGEMENT FOR PLAY L. VS \"STD\" ",null,null,null,null,null,null,null,"VS.STD"]
[null,null,null,"PLAY LENGTH VS STANDARD",null,null,"#3","#4","#5","#6","#7","#8","#9"]
{"$rows_left_out":110}
{"sheet":"Sheet2","index":7,"n_rows":11,"n_cols":9,"rows_kept":11,"cut":false,"hidden":true,"merged":[[1,1,2,6],[2,8,2,13],[10,8,10,13],[18,1,18,6],[17,8,18,13]]}
[]
[null,"FITTING"]
[null,null,null,null,null,null,null,null,"WORK SHOP"]
[]
[]
[]
[]
[]
[]
[]
[null,null,null,null,null,null,null,null,"HEAD WEIGHT ADJUSTMENT"]