{"text_format":"1","workbook":"xlsx","n_sheets":8,"sheets":["Sheet1","MOI DRY FIT IMPERIAL","DataBase","MOI DRY FIT METRIC","PRINT","SWC","Collection","Sheet2"],"not_rendered":{"charts":2,"images":7,"macros":1,"external_links":0,"defined_names":8,"comments":4,"pivot_tables":0},"unopened":[],"bounds":{"document_bytes":16777216,"sheet_cells":100000,"rows_first":2000,"rows_last":500,"rows_between":2000,"halvings":0,"cell_chars":16384,"cell_head_chars":4096},"cells_cut":0,"cells_raw":0,"read":"whole","date_system":"1900"}

{"sheet":"Sheet1","index":0,"n_rows":114,"n_cols":32,"rows_kept":114,"cut":false,"hidden":true,"merged":[[17,18,18,18],[17,1,18,1],[17,8,18,8],[17,9,18,9],[17,10,18,10],[17,11,18,11],[17,12,18,12],[17,7,18,7],[17,6,18,6],[17,5,18,5],[17,4,18,4],[17,3,18,3],[17,17,18,17],[17,2,18,2],[17,13,18,13],[17,14,18,14],[1,7,1,18],[11,4,11,5],[12,4,12,5],[11,1,11,3],[12,1,12,3],[7,1,7,3],[7,4,7,5],[9,1,9,3],[4,1,4,3],[10,1,10,3],[1,1,1,5],[6,1,6,3],[9,4,9,5],[4,4,4,5],[10,4,10,5],[12,10,12,13],[3,1,3,5],[17,15,18,15],[17,16,18,16],[5,1,5,3],[5,4,6,5],[15,1,16,7],[8,1,8,5],[10,11,10,12],[11,11,11,12]]}
[]
[null,"PREFERED FRACTIONS ON CHART",null,null,null,null,null,"Butt to tip correction due to choice of tip wgt - mm is tip WGT lenght as millimeter"]
[]
[null,"SET UP - BASIC CLUB SPECS",null,null,null,null,2,"Grams",0,1,2,3,4,5,6,7,8,9,10]
[null,"Grip Butt cap thickness",null,null,0.125,null,null," mm",0,{"$f":"AD30","v":3.9809523809523806},{"$f":"AD29","v":5.742857142857142},{"$f":"AD28","v":8.3368421052631572},{"$f":"AD27","v":10.933333333333335},{"$f":"AD26","v":13.531034482758622},{"$f":"AD25","v":16.129411764705882},{"$f":"AD24","v":18.728205128205133},{"$f":"AD23","v":21.225000000000001},{"$f":"AD22","v":23.9265306122449},{"$f":"AD21","v":26.326530612244898}]
[null,"LENGTH between clubs ",null,null,0.375,null,null,{"$f":"LOOKUP(I13,I4:R4,I7:R7)","v":0.19904761904761903}]
[null,"(1W-9W)-(H1-H7)-(#3-#9)",null,null,null,null,null,"BT corr",0,{"$f":"(J5/2)/10","v":0.19904761904761903},{"$f":"(K5/2)/10","v":0.28714285714285709},0.41684210526315785,0.54666666666666675,0.67655172413793108,0.80647058823529405,0.93641025641025666,1.06125,1.196326530612245,1.3163265306122449]
[null,"LENGTH BETWEEN WEDGES",null,null,0.25]
[null,"CLUB IN WORK - GREEN CLUB ON THE CHART"]
[null,"BBGM-Bottom of bore to Ground.",null,null,1.25,null,null,null,".((LENGTH cm x LENGTH cm)*1)/1000"]
[null,"Play Length longest             /GREEN club in work",null,null,39.125,null,null,"MOI points pr gram at this play lenght",null,null,null,{"$f":"((H20*H20)*1)/1000","v":9.2166628690617909},null,"Points pr.Gram"]
[null,"MOI points to ADD                          to the GREEN CLUB",null,null,25,null,null,"Grams pr MOI point at this play lenght",null,null,null,{"$f":"L11/100","v":9.2166628690617911E-2},null,"Gram pr. Point"]
[null,". =NEEDED WEIGTH IN GRAMS",null,null,{"$f":"E12/L11","v":2.7124785136623828},null,null,"Grams",1,1,"LIGHTEST TIP WGT - TIP W PROGRESSION"]
[]
[]
[null,"TIP WEIGHT AS GRAMS TO MOI POINT CHART",null,null,null,null,null,null,"Grams","Grams","Grams","Grams","Grams","Grams","Grams","Grams","Grams","Grams","Grams"]
[null,null,null,null,null,null,null,null,{"$f":"I13","v":1},{"$f":"I17+J13","v":2},{"$f":"J17+J13","v":3},{"$f":"K17+J13","v":4},{"$f":"L17+J13","v":5},{"$f":"M17+J13","v":6},{"$f":"N17+J13","v":7},{"$f":"O17+J13","v":8},{"$f":"P17+J13","v":9},{"$f":"Q17+J13","v":10},{"$f":"R17+J13","v":11}]
[null,"Play lenght","Play lenght","BBGM","Butt cap","Net shaft","Butt to tip","Butt to tip Cm","MOI Points","MOI Points","MOI Points","MOI Points","MOI Points","MOI Points","MOI Points","MOI Points","MOI Points","MOI Points","MOI Points"]
[]
[{"$f":"\"1W\"&\"/H1\"&\"/#3\"","v":"1W/H1/#3"},{"$f":"E11","v":39.125},{"$f":"B20","v":39.125},{"$f":"E10","v":1.25},{"$f":"E5","v":0.125},{"$f":"B20-D20-E20","v":37.75},{"$f":"F20+E20","v":37.875},{"$f":"(G20*2.54)-$H$6","v":96.003452380952382},{"$f":"($H20*$H20*(I$17/1000))","v":9.2166628690617909},18.433325738123582,27.649988607185374,36.866651476247164,46.083314345308956,55.299977214370749,64.516640083432534,73.733302952494327,82.949965821556106,92.166628690617912,101.38329155967969,null,null,null,"gram","mm","pr mm","Just MM","BT Just",null,null,"Matt"]
[{"$f":"\"2W\"&\"/H2\"&\"/#4\"","v":"2W/H2/#4"},{"$f":"B20-$E$6","v":38.75},38.75,{"$f":"D20","v":1.25},{"$f":"E20","v":0.125},37.375,{"$f":"F21+E21","v":37.5},95.050952380952381,9.0346835485260772,18.069367097052154,27.10405064557823,36.138734194104309,45.173417742630384,54.20810129115646,63.242784839682535,72.277468388208618,81.312151936734679,90.346835485260769,99.38151903378683,null,null,10,9.8000000000000007,25.8,{"$f":"X21/W21","v":2.6326530612244898},{"$f":"(X21/W21)*V21","v":26.326530612244898},{"$f":"Z21/2","v":13.163265306122449},null,null,{"$f":"Z21","v":26.326530612244898}]
[{"$f":"\"3W\"&\"/H3\"&\"/#5\"","v":"3W/H3/#5"},38.375,38.375,{"$f":"D21","v":1.25},{"$f":"E21","v":0.125},37,37.125,94.098452380952381,8.8545187404903629,17.709037480980726,26.563556221471089,35.418074961961452,44.272593702451815,53.127112442942177,61.98163118343254,70.836149923922903,79.690668664413252,88.545187404903629,97.399706145393978,null,null,9,8.8000000000000007,23.1,{"$f":"X22/W22","v":2.625},{"$f":"(X22/W22)*V22","v":23.625},{"$f":"Z22/2","v":11.8125},null,null,{"$f":"Z21-2.4","v":23.9265306122449}]
[{"$f":"\"4W\"&\"/H4\"&\"/#6\"","v":"4W/H4/#6"},38,38,1.25,0.125,36.625,36.75,93.14595238095238,8.6761684449546479,17.352336889909296,26.028505334863944,34.704673779818592,43.380842224773239,52.057010669727887,60.733179114682542,69.409347559637183,78.085516004591824,86.761684449546479,95.43785289450112,null,null,8,7.8,20.6,2.6410256410256414,21.128205128205131,10.564102564102566,null," ",{"$f":"Z22-2.4","v":21.225000000000001}," "," "]
[{"$f":"\"5W\"&\"/H5\"&\"/#7\"","v":"5W/H5/#7"},37.625,37.625,1.25,0.125,36.25,36.375,92.19345238095238,8.4996326619189357,16.999265323837871,25.498897985756805,33.998530647675743,42.498163309594673,50.997795971513611,59.497428633432548,67.997061295351486,76.496693957270409,84.996326619189347,93.495959281108284,null,null,7,6.8,18,2.6470588235294117,18.52941176470588,9.2647058823529402,null,null,18.728205128205133]
[{"$f":"\"7W\"&\"/H6\"&\"/#8\"","v":"7W/H6/#8"},37.25,37.25,1.25,0.125,35.875,36,91.240952380952379,8.3249113913832193,16.649822782766439,24.974734174149656,33.299645565532877,41.624556956916095,49.949468348299312,58.27437973968253,66.599291131065755,74.924202522448965,83.24911391383219,91.5740253052154,null,null,6,5.8,15.4,2.6551724137931036,15.931034482758623,7.9655172413793114,null,null,16.129411764705882]
[{"$f":"\"9W\"&\"/H7\"&\"/#9\"","v":"9W/H7/#9"},36.875,36.875,1.25,0.125,35.5,35.625,90.288452380952378,8.1520046333475058,16.304009266695012,24.456013900042517,32.608018533390023,40.760023166737533,48.912027800085035,57.064032433432544,65.216037066780046,73.368041700127549,81.520046333475065,89.672050966822553,null,null,5,4.8,12.8,2.666666666666667,13.333333333333336,6.6666666666666679,null,null,13.531034482758622]
[{"$f":"\"#\"&\"PW\"","v":"#PW"},{"$f":"B26-$E$8","v":36.625},36.625,1.25,0.125,35.25,35.375,89.653452380952388,8.0377415238236978,16.075483047647396,24.113224571471093,32.150966095294791,40.188707619118489,48.226449142942187,56.264190666765884,64.301932190589582,72.339673714413266,80.377415238236978,88.415156762060661,null,null,4,3.8,10.199999999999999,2.6842105263157894,10.736842105263158,5.3684210526315788,null,null,10.933333333333335]
["#GW",36.375,36.375,1.25,0.125,35,35.125,89.018452380952382,7.9242848642998869,15.848569728599774,23.772854592899662,31.697139457199548,39.621424321499433,47.545709185799325,55.46999405009921,63.394278914399095,71.318563778698973,79.242848642998865,87.167133507298757,null,null,3,2.8,7.6,2.7142857142857144,8.1428571428571423,4.0714285714285712,null,null,8.3368421052631572]
["#SW",36.125,36.125,1.25,0.125,34.75,34.875,88.383452380952377,7.8116346547760767,15.623269309552153,23.434903964328232,31.246538619104307,39.058173273880385,46.869807928656464,54.681442583432542,62.493077238208613,70.304711892984685,78.11634654776077,85.927981202536841,null,null,2,2.1,6.7,3.1904761904761902,6.3809523809523805,3.1904761904761902,null,null,5.742857142857142]
["#LW",35.875,35.875,1.25,0.125,34.5,34.625,87.748452380952386,{"$f":"($H30*$H30*(I$17/1000))","v":7.6997908952522689},15.399581790504538,23.099372685756805,30.799163581009076,38.498954476261346,46.19874537151361,53.89853626676588,61.598327162018151,69.298118057270415,76.997908952522693,84.697699847774942,null,null,1,1.1000000000000001,3,2.7272727272727271,2.7272727272727271,1.3636363636363635,null,null,3.9809523809523806]
[null,35.625,35.625,1.25,0.125,34.25,34.375,87.113452380952381,7.5887535857284583,15.177507171456917,22.766260757185375,30.355014342913833,37.943767928642295,45.53252151437075,53.121275100099211,60.710028685827666,68.298782271556121,75.88753585728459,83.47628944301303]
[null,35.375,35.375,1.25,0.125,34,34.125,86.478452380952376,7.4785227262046474,14.957045452409295,22.435568178613941,29.91409090481859,37.392613631023238,44.871136357227883,52.349659083432535,59.828181809637179,67.306704535841817,74.785227262046476,82.263749988251121]
[null,35.125,35.125,1.25,0.125,33.75,33.875,85.843452380952385,7.3690983166808399,14.73819663336168,22.107294950042522,29.47639326672336,36.845491583404204,44.214589900085045,51.583688216765879,58.952786533446719,66.32188485012756,73.690983166808408,81.060081483489242]
[null,34.875,34.875,1.25,0.125,33.5,33.625,85.20845238095238,7.2604803571570296,14.520960714314059,21.78144107147109,29.041921428628118,36.302401785785143,43.562882142942179,50.823362500099208,58.083842857256236,65.344323214413251,72.604803571570287,79.865283928727322]
[null,34.625,34.625,1.25,0.125,33.25,33.375,84.573452380952389,7.1526688476332216,14.305337695266443,21.458006542899664,28.610675390532887,35.763344238166106,42.916013085799328,50.068681933432551,57.221350781065773,64.374019628698989,71.526688476332211,78.679357323965434]
[null,34.375,34.375,1.25,0.125,33,33.125,83.938452380952384,7.0456637881094109,14.091327576218822,21.136991364328235,28.182655152437643,35.228318940547055,42.27398272865647,49.319646516765879,56.365310304875287,63.410974092984695,70.45663788109411,77.502301669203518]
[null,{"$f":"C37","v":34.125},{"$f":"B36-$E$8","v":34.125},{"$f":"D36","v":1.25},{"$f":"E36","v":0.125},{"$f":"C37-D37-E37","v":32.75},32.875,83.303452380952379,{"$f":"($H37*$H37*(I$17/1000))","v":6.9394651785856007},13.878930357171201,20.818395535756803,27.757860714342403,34.697325892927999,41.636791071513606,48.576256250099206,55.515721428684806,62.455186607270399,69.394651785855999,76.334116964441606]
[null,33.875,{"$f":"C37-$E$8","v":33.875},1.25,0.125,{"$f":"C38-D38-E38","v":32.5},{"$f":"F38+E38","v":32.625},82.668452380952388,6.8340730190617922,13.668146038123584,20.502219057185378,27.336292076247169,34.170365095308959,41.004438114370757,47.838511133432547,54.672584152494338,61.506657171556128,68.340730190617919,75.174803209679709]
[null,33.625,33.625,1.25,0.125,{"$f":"C39-D39-E39","v":32.25},{"$f":"F39+E39","v":32.375},82.033452380952383,6.7294873095379826,13.458974619075965,20.188461928613947,26.91794923815193,33.647436547689914,40.376923857227894,47.106411166765881,53.835898476303861,60.565385785841841,67.294873095379828,74.0243604049178]
[null,33.375,33.375,1.25,0.125,32,32.125,81.398452380952378,{"$f":"($H40*$H40*(I$17/1000))","v":6.6257080500141718},13.251416100028344,19.877124150042516,26.502832200056687,33.128540250070863,39.754248300085031,46.379956350099206,53.005664400113375,59.631372450127543,66.257080500141726,72.882788550155894]
[null,33.125,33.125,1.25,0.125,31.75,31.875,80.763452380952387,6.5227352404903645,13.045470480980729,19.568205721471092,26.090940961961458,32.613676202451821,39.136411442942183,45.659146683432546,52.181881923922916,58.704617164413271,65.227352404903641,71.750087645394004]
[null,32.875,32.875,1.25,0.125,31.5,31.625,80.128452380952382,6.4205688809665533,12.841137761933107,19.261706642899661,25.682275523866213,32.102844404832766,38.523413285799322,44.943982166765878,51.364551047732427,57.785119928698975,64.205688809665531,70.626257690632087]
[null,32.625,32.625,1.25,0.125,31.25,31.375,79.493452380952377,6.3192089714427429,12.638417942885486,18.95762691432823,25.276835885770971,31.596044857213716,37.915253828656461,44.234462800099202,50.553671771541943,56.872880742984684,63.192089714427432,69.511298685870173]
[null,32.375,32.375,1.25,0.125,31,31.125,78.858452380952386,6.2186555119189357,12.437311023837871,18.655966535756807,24.874622047675743,31.093277559594675,37.311933071513614,43.530588583432547,49.749244095351486,55.967899607270411,62.18655511918935,68.405210631108289]
[null,32.125,32.125,1.25,0.125,30.75,30.875,78.223452380952381,6.1189085023951248,12.23781700479025,18.356725507185374,24.475634009580499,30.594542511975625,36.713451014370747,42.832359516765877,48.951268019160999,55.070176521556121,61.18908502395125,67.307993526346365]
[null,31.875,31.875,1.25,0.125,30.5,30.625,77.588452380952376,6.0199679428713146,12.039935885742629,18.059903828613944,24.079871771485259,30.099839714356573,36.119807657227888,42.139775600099199,48.159743542970517,54.179711485841828,60.199679428713146,66.219647371584458]
[null,31.625,31.625,1.25,0.125,30.25,30.375,76.953452380952385,5.9218338333475069,11.843667666695014,17.765501500042522,23.687335333390028,29.609169166737534,35.531003000085043,41.452836833432549,47.374670666780055,53.296504500127554,59.218338333475067,65.140172166822566]
[null,31.375,31.375,1.25,0.125,30,30.125,76.31845238095238,5.8245061738236963,11.649012347647393,17.473518521471089,23.298024695294785,29.122530869118481,34.947037042942178,40.771543216765878,46.59604939058957,52.420555564413263,58.245061738236963,64.069567912060663]
[null,31.125,31.125,1.25,0.125,29.75,29.875,75.683452380952389,5.7279849642998881,11.455969928599776,17.183954892899663,22.911939857199553,28.639924821499442,34.367909785799327,40.09589475009922,45.823879714399105,51.55186467869899,57.279849642998883,63.007834607298761]
[null,30.875,30.875,1.25,0.125,29.5,29.625,75.048452380952384,{"$f":"($H50*$H50*(I$17/1000))","v":5.632270204776078},11.264540409552156,16.896810614328235,22.529080819104312,28.161351023880389,33.79362122865647,39.425891433432547,45.058161638208624,50.690431842984694,56.322702047760778,61.954972252536848]
[null,30.625,30.625,1.25,0.125,29.25,29.375,74.413452380952378,5.5373618952522676,11.074723790504535,16.612085685756803,22.149447581009071,27.686809476261338,33.224171371513606,38.761533266765873,44.298895162018141,49.836257057270402,55.373618952522676,60.910980847774937]
[null,30.375,30.375,1.25,0.125,29,29.125,{"$f":"(G52*2.54)-$H$6","v":73.778452380952388},5.4432600357284588,10.886520071456918,16.329780107185378,21.773040142913835,27.216300178642296,32.659560214370757,38.102820250099214,43.546080285827671,48.989340321556128,54.432600357284592,59.875860393013049]
[null,30.125,30.125,1.25,0.125,28.75,28.875,73.143452380952382,5.349964626204649,10.699929252409298,16.049893878613947,21.399858504818596,26.749823131023245,32.099787757227894,37.449752383432546,42.799717009637192,48.149681635841837,53.49964626204649,58.849610888251135]
[null,29.875,29.875,1.25,0.125,28.5,28.625,72.508452380952377,5.2574756666808389,10.514951333361678,15.772427000042518,21.029902666723356,26.287378333404195,31.544854000085035,36.802329666765871,42.059805333446711,47.317281000127544,52.574756666808391,57.832232333489223]
[null,29.625,29.625,1.25,0.125,28.25,28.375,71.873452380952386,5.1657931571570304,10.331586314314061,15.497379471471092,20.663172628628121,25.828965785785154,30.994758942942184,36.160552100099217,41.326345257256243,46.492138414413276,51.657931571570309,56.823724728727335]
[null,29.375,29.375,1.25,0.125,28,28.125,71.238452380952381,5.0749170976332199,10.14983419526644,15.22475129289966,20.299668390532879,25.374585488166101,30.449502585799319,35.524419683432541,40.599336781065759,45.674253878698977,50.749170976332202,55.824088073965413]
[null,29.125,29.125,1.25,0.125,27.75,27.875,70.603452380952376,4.98484748810941,9.9696949762188201,14.954542464328229,19.93938995243764,24.924237440547049,29.909084928656458,34.893932416765871,39.87877990487528,44.863627392984682,49.848474881094099,54.833322369203508]
[null,28.875,28.875,1.25,0.125,27.5,27.625,69.968452380952385,4.8955843285856018,9.7911686571712035,14.686752985756806,19.582337314342407,24.47792164292801,29.373505971513612,34.269090300099215,39.164674628684814,44.060258957270413,48.95584328585602,53.851427614441619]
[null,28.625,28.625,1.25,0.125,27.25,27.375,69.33345238095238,4.8071276190617906,9.6142552381235813,14.421382857185373,19.228510476247163,24.035638095308954,28.842765714370746,33.649893333432537,38.457020952494325,43.264148571556113,48.071276190617908,52.878403809679696]
[null,28.375,28.375,1.25,0.125,27,27.125,68.698452380952389,{"$f":"($H60*$H60*(I$17/1000))","v":4.7194773595379829},9.4389547190759657,14.158432078613949,18.877909438151931,23.597386797689914,28.316864157227897,33.03634151676588,37.755818876303863,42.475296235841846,47.194773595379829,51.914250954917811]
[null,28.125,28.125,1.25,0.125,26.75,26.875,68.063452380952384,4.6326335500141731,9.2652671000283462,13.897900650042519,18.530534200056692,23.163167750070865,27.795801300085039,32.428434850099215,37.061068400113385,41.693701950127554,46.326335500141731,50.958969050155901]
[null,27.875,27.875,1.25,0.125,26.5,26.625,67.428452380952379,4.5465961904903622,9.0931923809807245,13.639788571471088,18.186384761961449,22.732980952451811,27.279577142942177,31.826173333432539,36.372769523922898,40.91936571441326,45.465961904903622,50.012558095393985]
[null,27.625,27.625,1.25,0.125,{"$f":"C63-D63-E63","v":26.25},{"$f":"F63+E63","v":26.375},66.793452380952388,4.4613652809665547,8.9227305619331094,13.384095842899663,17.845461123866219,22.306826404832773,26.768191685799327,31.229556966765884,35.690922247732438,40.152287528698992,44.613652809665545,49.075018090632099]
[null,27.375,27.375,1.25,0.125,26,26.125,66.158452380952383,4.3769408214427443,8.7538816428854886,13.130822464328233,17.507763285770977,21.884704107213722,26.261644928656466,30.63858575009921,35.015526571541955,39.392467392984692,43.769408214427443,48.14634903587018]
[null,27.125,27.125,1.25,0.125,25.75,25.875,65.523452380952378,4.2933228119189337,8.5866456238378674,12.879968435756801,17.173291247675735,21.466614059594669,25.759936871513602,30.053259683432536,34.34658249535147,38.639905307270396,42.933228119189337,47.226550931108264]
[null,26.875,26.875,1.25,0.125,25.5,25.625,64.888452380952387,4.2105112523951256,8.4210225047902512,12.631533757185377,16.842045009580502,21.052556261975628,25.263067514370753,29.473578766765879,33.684090019161005,37.894601271556127,42.105112523951256,46.315623776346378]
[null,26.625,26.625,1.25,0.125,25.25,25.375,64.253452380952382,4.1285061428713155,8.2570122857426309,12.385518428613945,16.514024571485262,20.642530714356578,24.771036857227891,28.899543000099207,33.028049142970524,37.156555285841833,41.285061428713156,45.413567571584466]
[null,26.375,26.375,1.25,0.125,25,25.125,63.618452380952384,4.047307483347506,8.094614966695012,12.141922450042518,16.189229933390024,20.23653741673753,24.283844900085036,28.331152383432542,32.378459866780048,36.425767350127551,40.47307483347506,44.520382316822563]
[null,26.125,26.125,1.25,0.125,24.75,24.875,62.983452380952379,3.9669152738236959,7.9338305476473918,11.900745821471087,15.867661095294784,19.83457636911848,23.801491642942175,27.768406916765873,31.735322190589567,35.702237464413258,39.66915273823696,43.636068012060647]
[null,25.875,{"$f":"C69-$E$8","v":25.875},1.25,0.125,24.5,24.625,62.348452380952381,{"$f":"($H70*$H70*(I$17/1000))","v":3.8873295142998869},7.7746590285997739,11.66198854289966,15.549318057199548,19.436647571499435,23.323977085799321,27.21130660009921,31.098636114399095,34.985965628698978,38.87329514299887,42.760624657298749]
[null,25.625,25.625,1.25,0.125,24.25,24.375,61.713452380952383,3.8085502047760773,7.6171004095521546,11.425650614328232,15.234200819104309,19.042751023880388,22.851301228656464,26.659851433432543,30.468401638208618,34.276951842984694,38.085502047760777,41.894052252536852]
[null,25.375,25.375,1.25,0.125,24,24.125,61.078452380952385,3.7305773452522679,7.4611546905045358,11.191732035756804,14.922309381009072,18.65288672626134,22.383464071513608,26.114041416765875,29.844618762018143,33.575196107270408,37.305773452522679,41.036350797774944]
[null,25.125,25.125,1.25,0.125,23.75,23.875,60.44345238095238,3.6534109357284579,7.3068218714569158,10.960232807185374,14.613643742913832,18.267054678642289,21.920465614370748,25.573876550099204,29.227287485827663,32.880698421556119,36.534109357284578,40.187520293013037]
[null,24.875,24.875,1.25,0.125,{"$f":"C74-D74-E74","v":23.5},{"$f":"F74+E74","v":23.625},59.808452380952382,3.5770509762046485,7.154101952409297,10.731152928613946,14.308203904818594,17.885254881023243,21.462305857227893,25.039356833432542,28.616407809637188,32.193458785841834,35.770509762046487,39.347560738251133]
[null,24.625,24.625,1.25,0.125,23.25,23.375,59.173452380952384,3.5014974666808394,7.0029949333616788,10.504492400042519,14.005989866723358,17.507487333404196,21.008984800085038,24.510482266765877,28.011979733446715,31.51347720012755,35.014974666808392,38.516472133489231]
[null,24.375,24.375,1.25,0.125,23,23.125,58.538452380952386,3.4267504071570301,6.8535008143140601,10.28025122147109,13.70700162862812,17.13375203578515,20.56050244294218,23.98725285009921,27.41400325725624,30.84075366441327,34.267504071570301,37.694254478727331]
[null,24.125,24.125,1.25,0.125,22.75,22.875,57.90345238095238,3.3528097976332201,6.7056195952664401,10.05842939289966,13.41123919053288,16.764048988166103,20.11685878579932,23.46966858343254,26.822478381065761,30.175288178698978,33.528097976332205,36.880907773965419]
[null,23.875,23.875,1.25,0.125,22.5,22.625,57.268452380952382,3.2796756381094108,6.5593512762188215,9.8390269143282314,13.118702552437643,16.398378190547053,19.678053828656463,22.957729466765873,26.237405104875286,29.517080742984692,32.796756381094106,36.076432019203516]
[null,23.625,23.625,1.25,0.125,22.25,22.375,56.633452380952384,3.2073479285856017,6.4146958571712034,9.6220437857568051,12.829391714342407,16.036739642928008,19.24408757151361,22.451435500099212,25.658783428684814,28.866131357270412,32.073479285856017,35.280827214441615]
[null,23.375,23.375,1.25,0.125,22,22.125,55.998452380952379,{"$f":"($H80*$H80*(I$17/1000))","v":3.1358266690617911},6.2716533381235822,9.4074800071853737,12.543306676247164,15.679133345308957,18.814960014370747,21.95078668343254,25.086613352494329,28.222440021556118,31.358266690617913,34.494093359679702]
[null,23.125,23.125,1.25,0.125,21.75,21.875,55.363452380952381,3.0651118595379816,6.1302237190759632,9.1953355786139443,12.260447438151926,15.325559297689908,18.390671157227889,21.455783016765871,24.520894876303853,27.586006735841831,30.651118595379817,33.716230454917799]
[null,22.875,22.875,1.25,0.125,21.5,21.625,54.728452380952383,2.9952035000141728,5.9904070000283456,8.9856105000425188,11.980814000056691,14.976017500070864,17.971221000085038,20.966424500099208,23.961628000113382,26.956831500127553,29.952035000141727,32.947238500155898]
[null,22.625,22.625,1.25,0.125,21.25,21.375,54.093452380952385,2.9261015904903633,5.8522031809807267,8.77830477147109,11.704406361961453,14.630507952451817,17.55660954294218,20.482711133432545,23.408812723922907,26.334914314413268,29.261015904903633,32.187117495393998]
[null,22.375,22.375,1.25,0.125,21,21.125,{"$f":"(G84*2.54)-$H$6","v":53.45845238095238},2.8578061309665532,5.7156122619331065,8.5734183928996597,11.431224523866213,14.289030654832766,17.146836785799319,20.004642916765871,22.862449047732426,25.720255178698977,28.578061309665532,31.435867440632084]
[null,{"$f":"C85","v":22.125},22.125,1.25,0.125,20.75,20.875,52.823452380952382,2.7903171214427438,5.5806342428854876,8.3709513643282314,11.161268485770975,13.951585607213719,16.741902728656463,19.532219850099207,22.32253697154195,25.112854092984694,27.903171214427438,30.693488335870182]
[null,21.875,21.875,{"$f":"D85","v":1.25},{"$f":"E85","v":0.125},20.5,20.625,52.188452380952384,2.7236345619189346,5.4472691238378692,8.1709036857568034,10.894538247675738,13.618172809594673,16.341807371513607,19.065441933432542,21.789076495351477,24.512711057270408,27.236345619189347,29.959980181108278]
[null,21.625,21.625,1.25,0.125,20.25,20.375,51.553452380952379,2.6577584523951248,5.3155169047902495,7.9732753571853738,10.631033809580499,13.288792261975622,15.946550714370748,18.604309166765873,21.262067619160998,23.91982607155612,26.577584523951245,29.235342976346367]
[null,21.375,21.375,1.25,0.125,20,20.125,50.918452380952381,2.5926887928713156,5.1853775857426312,7.7780663786139463,10.370755171485262,12.963443964356577,15.556132757227893,18.148821550099207,20.741510342970525,23.334199135841835,25.926887928713153,28.519576721584468]
[null,21.125,21.125,1.25,0.125,19.75,19.875,50.283452380952383,2.5284255833475058,5.0568511666950116,7.5852767500425173,10.113702333390023,12.642127916737529,15.170553500085035,17.69897908343254,20.227404666780046,22.755830250127552,25.284255833475058,27.812681416822564]
[null,20.875,20.875,1.25,0.125,19.5,19.625,49.648452380952385,{"$f":"($H90*$H90*(I$17/1000))","v":2.4649688238236966},4.9299376476473933,7.3949064714710904,9.8598752952947866,12.324844119118485,14.789812942942181,17.254781766765877,19.719750590589573,22.184719414413269,24.649688238236969,27.114657062060662]
[null,20.625,20.625,1.25,0.125,19.25,19.375,49.01345238095238,2.4023185142998864,4.8046370285997728,7.2069555428996592,9.6092740571995456,12.011592571499433,14.413911085799318,16.816229600099206,19.218548114399091,21.620866628698977,24.023185142998866,26.425503657298748]
[null,20.375,20.375,1.25,0.125,{"$f":"C92-D92-E92","v":19},{"$f":"F92+E92","v":19.125},48.378452380952382,2.3404746547760773,4.6809493095521546,7.0214239643282319,9.3618986191043092,11.702373273880387,14.042847928656464,16.383322583432541,18.723797238208618,21.064271892984696,23.404746547760773,25.74522120253685]
[null,20.125,20.125,1.25,0.125,18.75,18.875,47.743452380952384,2.279437245252268,4.558874490504536,6.838311735756804,9.1177489810090719,11.39718622626134,13.676623471513608,15.956060716765876,18.235497962018144,20.514935207270412,22.79437245252268,25.073809697774948]
[null,19.875,19.875,1.25,0.125,18.5,18.625,47.108452380952379,2.2192062857284576,4.4384125714569151,6.6576188571853736,8.8768251429138303,11.09603142864229,13.315237714370747,15.534444000099205,17.753650285827661,19.972856571556118,22.192062857284579,24.411269143013033]
[null,19.625,19.625,1.25,0.125,18.25,18.375,46.473452380952381,2.1597817762046483,4.3195635524092966,6.4793453286139453,8.6391271048185931,10.798908881023243,12.958690657227891,15.118472433432538,17.278254209637186,19.438035985841832,21.597817762046486,23.757599538251132]
[null,19.375,19.375,1.25,0.125,18,18.125,45.838452380952383,2.1011637166808392,4.2023274333616785,6.3034911500425173,8.4046548667233569,10.505818583404196,12.606982300085035,14.708146016765873,16.809309733446714,18.910473450127551,21.011637166808391,23.112800883489228]
[null,19.125,19.125,1.25,0.125,17.75,17.875,45.203452380952385,2.04335210715703,4.0867042143140599,6.1300563214710895,8.1734084286281199,10.21676053578515,12.260112642942179,14.303464750099209,16.34681685725624,18.390168964413267,20.433521071570301,22.476873178727327]
[null,18.875,18.875,1.25,0.125,17.5,17.625,44.56845238095238,1.9863469476332198,3.9726938952664397,5.9590408428996593,7.9453877905328794,9.9317347381660994,11.918081685799319,13.90442863343254,15.890775581065759,17.877122528698976,19.863469476332199,21.849816423965414]
[null,18.625,18.625,1.25,0.125,17.25,17.375,43.933452380952382,1.9301482381094104,3.8602964762188208,5.7904447143282312,7.7205929524376415,9.6507411905470519,11.580889428656462,13.511037666765873,15.441185904875283,17.371334142984693,19.301482381094104,21.231630619203514]
[null,18.375,18.375,1.25,0.125,17,17.125,43.298452380952384,{"$f":"($H100*$H100*(I$17/1000))","v":1.8747559785856012},3.7495119571712023,5.6242679357568033,7.4990239143424047,9.3737798929280061,11.248535871513607,13.123291850099207,14.998047828684809,16.872803807270408,18.747559785856012,20.622315764441609]
[null,18.125,18.125,1.25,0.125,16.75,16.875,42.663452380952378,1.8201701690617911,3.6403403381235822,5.460510507185373,7.2806806762471643,9.1008508453089547,10.921021014370746,12.741191183432537,14.561361352494329,16.38153152155612,18.201701690617909,20.021871859679699]
[null,17.875,{"$f":"C101-$E$8","v":17.875},1.25,0.125,16.5,16.625,42.02845238095238,1.7663908095379819,3.5327816190759638,5.2991724286139457,7.0655632381519275,8.8319540476899085,10.598344857227891,12.364735666765872,14.131126476303855,15.897517285841834,17.663908095379817,19.430298904917798]
[null,17.625,17.625,1.25,0.125,16.25,16.375,41.393452380952382,1.7134179000141725,3.426835800028345,5.1402537000425168,6.85367160005669,8.5670895000708622,10.280507400085034,11.993925300099207,13.70734320011338,15.42076110012755,17.134179000141724,18.847596900155896]
[null,17.375,17.375,1.25,0.125,16,16.125,40.758452380952384,1.6612514404903631,3.3225028809807262,4.98375432147109,6.6450057619614524,8.3062572024518158,9.96750864294218,11.628760083432542,13.290011523922905,14.951262964413267,16.612514404903632,18.273765845393992]
[null,17.125,17.125,1.25,0.125,15.75,15.875,40.123452380952379,1.6098914309665531,3.2197828619331061,4.8296742928996599,6.4395657238662123,8.0494571548327656,9.6593485857993198,11.269240016765872,12.879131447732425,14.489022878698977,16.098914309665531,17.708805740632084]
[null,16.875,16.875,1.25,0.125,15.5,15.625,39.488452380952381,1.5593378714427437,3.1186757428854874,4.6780136143282318,6.2373514857709749,7.7966893572137188,9.3560272286564636,10.915365100099207,12.47470297154195,14.034040842984693,15.593378714427438,17.152716585870181]
[null,16.625,16.625,1.25,0.125,15.25,15.375,38.853452380952383,1.5095907619189346,3.0191815238378692,4.528772285756804,6.0383630476757384,7.5479538095946728,9.057544571513608,10.567135333432542,12.076726095351477,13.586316857270409,15.095907619189346,16.60549838110828]
[null,16.375,16.375,1.25,0.125,15,15.125,38.218452380952385,1.460650102395125,2.9213002047902501,4.3819503071853756,5.8426004095805002,7.3032505119756257,8.7639006143707512,10.224550716765876,11.685200819161,13.145850921556125,14.606501023951251,16.067151126346374]
[]
["Range","choice","choosen"]
[1,0.125,0]
[2,6.25E-2]
[3,3.125E-2]
[4,10]

{"sheet":"MOI DRY FIT IMPERIAL","index":1,"n_rows":118,"n_cols":33,"rows_kept":118,"cut":false,"hidden":true,"merged":[[17,17,18,17],[17,18,18,18],[17,19,18,19],[17,1,18,1],[17,9,18,9],[17,10,18,10],[17,11,18,11],[17,12,18,12],[12,11,12,13],[12,14,12,16],[17,13,18,13],[17,14,18,14],[17,2,18,2],[17,3,18,3],[17,4,18,4],[17,5,18,5],[17,6,18,6],[17,7,18,7],[17,8,18,8],[17,15,18,15],[17,16,18,16],[1,2,1,6],[2,8,2,19],[3,2,3,6],[4,2,4,4],[4,5,4,6],[5,5,6,6],[15,1,16,3],[15,4,16,4],[15,5,16,8],[5,2,6,4],[7,2,7,4],[7,5,7,6],[8,2,8,6],[9,2,9,4],[9,5,9,6],[11,2,11,4],[11,5,11,6],[12,2,12,4],[12,5,12,6],[10,2,10,4],[10,5,10,6]]}
[null,null,null,null,null,null,1,null,0]
[null,null,"PREFERED FRACTIONS ON CHART",null,null,null,null,null,"DIM CHART"]
[null,null,"1/8\"","1/16\"","1/32\"","1,00\""]
[null,null,"BASIC CLUB SPEC SET UP",null,null,null,null,null,"1W","2W","3W","4W","5W","7W","H1","H2","H3","H4","H5","H6"]
[null,null,"Grip Butt cap thickness",null,null,0.125,null,null,44,43.25,42.75,42.25,41.75,40.75,{"$f":"I7+1.25","v":40.75},40.25,39.75,39.25,38.75,38.25]
[null,null,"LENGTH between clubs ",null,null,0.375,null,null,"#2","#3","#4","#5","#6","#7","#8","#9","PW","GW","SW","LW"]
[null,null,null,null,null,null,null,null,{"$f":"DataBase!M8+39.5","v":39.5},{"$f":"I7-0.5","v":39},{"$f":"J7-0.5","v":38.5},38,37.5,37,36.5,36,{"$f":"P7-0.25","v":35.75},{"$f":"Q7-0.25","v":35.5},{"$f":"R7-0.25","v":35.25},{"$f":"S7-0.25","v":35}]
[null,null,"LENGTH BETWEEN WEDGES",null,null,0.375,null,null,"SUGGEST",{"$f":"C20","v":39.375},{"$f":"C21","v":39},{"$f":"C22","v":38.625},{"$f":"C23","v":38.25},{"$f":"C24","v":37.875},{"$f":"C25","v":37.5},{"$f":"C26","v":37.125},{"$f":"C27","v":36.75},{"$f":"C28","v":36.375},{"$f":"C29","v":36},{"$f":"C30","v":35.625}]
[null,null,"CLUB IN WORK - GREEN CLUB ON THE CHART",null,null,null,null,null,"DIFFERENCE",{"$f":"J8-J7","v":0.375},{"$f":"K8-K7","v":0.5},0.625,0.75,0.875,1,1.125,1,0.875,0.75,0.625]
[null,null,"BBGM-Bottom of bore to Ground.",null,null,1.25]
[null,null,"Play Length GREEN club in work",null,null,39.375,null,null,"  "," "," "," "," ",null,null,null,"MOI PROG",1.33,1]
[null,null,"MOI-P TO ADD-GREEN CLUB",null,null,10,null,null," "," "," "," "," ",null,null,null,"MOI PR.MM",null,{"$f":"R11/S11","v":1.33}]
[null,null,". =NEEDED WEIGTH IN GRAMS",null,null,{"$f":"F12/R13","v":1.0707784923696182},null,null,"Grams",1,1,"LIGHTEST TIP W.-TIP W PROG.",null,null,"MOI points pr gram at this lenght",null,null,{"$f":"((I20*I20)*1)/1000","v":9.3389996822500017},"Gr.MOI-P",{"$f":"R13/100","v":9.3389996822500015E-2}]
[]
[]
[null,"SW PROGRESSION BETW.CLUBS",null,null,{"$f":"S13","v":"Gr.MOI-P"},"TIP WEIGHT AS GRAMS TO MOI POINT CHART",null,null,null,"Grams","Grams","Grams","Grams","Grams","Grams","Grams","Grams","Grams","Grams","Grams"]
[null,null,null,null,null,null,null,null,null,{"$f":"J13","v":1},{"$f":"J17+K13","v":2},{"$f":"K17+K13","v":3},{"$f":"L17+K13","v":4},{"$f":"M17+K13","v":5},{"$f":"N17+K13","v":6},{"$f":"O17+K13","v":7},{"$f":"P17+K13","v":8},{"$f":"Q17+K13","v":9},{"$f":"R17+K13","v":10},{"$f":"S17+K13","v":11}]
[null,"CLUB","Play lenght","Play lenght","BBGM","Butt cap","Net shaft","Butt to tip","Butt-tip Cm","MOI Points","MOI Points","MOI Points","MOI Points","MOI Points","MOI Points","MOI Points","MOI Points","MOI Points","MOI Points","MOI Points"]
[]
[null,"IN WORK",{"$f":"F11","v":39.375},{"$f":"C20","v":39.375},{"$f":"F10","v":1.25},{"$f":"F5","v":0.125},{"$f":"C20-E20-F20","v":38},{"$f":"G20+F20","v":38.125},{"$f":"(H20*2.54)-$T$117","v":96.638500000000008},{"$f":"($I20*$I20*(J$17/1000))","v":9.3389996822500017},18.677999364500003,28.016999046750005,37.355998729000007,46.694998411250012,56.03399809350001,65.372997775750008,74.711997458000013,84.050997140250004,93.389996822500024,102.72899650475001,null,null,null,"gram","mm","pr mm","Just MM","BT Just",null,null,"Matt"]
[null,"#4",{"$f":"C20-$F$6","v":39},39,{"$f":"E20","v":1.25},{"$f":"F20","v":0.125},37.625,{"$f":"G21+F21","v":37.75},95.686000000000007,9.155810596000002,18.311621192000004,27.467431788000003,36.623242384000008,45.77905298000001,54.934863576000005,64.090674172000007,73.246484768000016,82.402295364000011,91.55810596000002,100.713916556,null,null,10,9.8000000000000007,25.8,{"$f":"Y21/X21","v":2.6326530612244898},{"$f":"(Y21/X21)*W21","v":26.326530612244898},{"$f":"AA21/2","v":13.163265306122449},null,null,{"$f":"AA21","v":26.326530612244898}]
[null,"#5",38.625,38.625,{"$f":"E21","v":1.25},0.125,37.25,37.375,94.733500000000006,8.9744360222500017,17.948872044500003,26.923308066750007,35.897744089000007,44.87218011125001,53.846616133500014,62.821052155750017,71.795488178000014,80.769924200250003,89.744360222500021,98.71879624475001,null,null,9,8.8000000000000007,23.1,{"$f":"Y22/X22","v":2.625},{"$f":"(Y22/X22)*W22","v":23.625},{"$f":"AA22/2","v":11.8125},null,null,{"$f":"AA21-2.4","v":23.9265306122449}]
[null,"#6",38.25,38.25,1.25,0.125,36.875,37,93.781000000000006,8.7948759610000025,17.589751922000005,26.384627883000004,35.17950384400001,43.974379805000005,52.769255766000008,61.56413172700001,70.35900768800002,79.153883649000008,87.94875961000001,96.743635571000013,null,null,8,7.8,20.6,2.6410256410256414,21.128205128205131,10.564102564102566,null," ",{"$f":"AA22-2.4","v":21.225000000000001}," "," "]
[null,"#7",37.875,37.875,1.25,0.125,36.5,36.625,92.828500000000005,8.6171304122500008,17.234260824500002,25.851391236750001,34.468521649000003,43.085652061250002,51.702782473500001,60.319912885750007,68.937043298000006,77.554173710249998,86.171304122500004,94.788434534749996,null,null,7,6.8,18,2.6470588235294117,18.52941176470588,9.2647058823529402,null,null,18.728205128205133]
[null,"#8",37.5,37.5,1.25,0.125,36.125,36.25,91.876000000000005,8.4411993760000001,16.882398752,25.323598128,33.764797504000001,42.205996880000001,50.647196256000001,59.088395632000008,67.529595008000001,75.970794384000001,84.411993760000001,92.853193136000002,null,null,6,5.8,15.4,2.6551724137931036,15.931034482758623,7.9655172413793114,null,null,16.129411764705882]
[null,"#9",37.125,37.125,1.25,0.125,35.75,35.875,90.923500000000004,8.2670828522500024,16.534165704500005,24.801248556750004,33.06833140900001,41.335414261250008,49.602497113500007,57.869579965750013,66.136662818000019,74.403745670250004,82.670828522500017,90.937911374750016,null,null,5,4.8,12.8,2.666666666666667,13.333333333333336,6.6666666666666679,null,null,13.531034482758622]
[null,{"$f":"\"#\"&\"PW\"","v":"#PW"},{"$f":"C26-$F$8","v":36.75},36.75,1.25,0.125,35.375,35.5,89.971000000000004,8.0947808410000004,16.189561682000001,24.284342523000003,32.379123364000002,40.473904205000004,48.568685046000006,56.663465887000008,64.758246728000003,72.853027569000005,80.947808410000007,89.042589250999995,null,null,4,3.8,10.199999999999999,2.6842105263157894,10.736842105263158,5.3684210526315788,null,null,10.933333333333335]
[null,"#GW",36.375,36.375,1.25,0.125,35,35.125,89.018500000000003,7.9242933422500013,15.848586684500003,23.772880026750002,31.697173369000005,39.621466711250008,47.545760053500004,55.470053395750007,63.39434673800001,71.318640080250006,79.242933422500016,87.167226764750012,null,null,3,2.8,7.6,2.7142857142857144,8.1428571428571423,4.0714285714285712,null,null,8.3368421052631572]
[null,"#SW",36,36,1.25,0.125,34.625,34.75,88.066000000000003,7.7556203560000005,15.511240712000001,23.266861068000001,31.022481424000002,38.77810178,46.533722136000002,54.289342492000003,62.044962848000004,69.800583203999992,77.55620356,85.311823915999994,null,null,2,2.1,6.7,3.1904761904761902,6.3809523809523805,3.1904761904761902,null,null,5.742857142857142]
[null,"#LW",35.625,35.625,1.25,0.125,34.25,34.375,87.113500000000002,7.5887618822500009,15.177523764500002,22.766285646750003,30.355047529000004,37.943809411250008,45.532571293500006,53.12133317575001,60.710095058000007,68.298856940250005,75.887618822500016,83.476380704749999,null,null,1,1.1000000000000001,3,2.7272727272727271,2.7272727272727271,1.3636363636363635,null,null,3.9809523809523806]
[null,null,35.25,35.25,1.25,0.125,33.875,34,86.161000000000001,7.4237179210000006,14.847435842000001,22.271153763000001,29.694871684000002,37.118589605000004,44.542307526000002,51.966025447000007,59.389743368000005,66.813461289000003,74.237179210000008,81.660897130999999]
[null,null,34.875,34.875,1.25,0.125,33.5,33.625,85.208500000000001,7.2604884722500005,14.520976944500001,21.781465416750002,29.041953889000002,36.302442361250002,43.562930833500005,50.823419305750001,58.083907778000004,65.34439625025,72.604884722500003,79.865373194749992]
[null,null,34.5,34.5,1.25,0.125,33.125,33.25,84.256,7.0990735359999997,14.198147071999999,21.297220608,28.396294143999999,35.495367680000001,42.594441216,49.693514751999999,56.792588287999997,63.891661823999996,70.990735360000002,78.089808895999994]
[null,null,34.125,34.125,1.25,0.125,32.75,32.875,83.3035,6.93947311225,13.8789462245,20.818419336750001,27.757892449,34.697365561250002,41.636838673500002,48.576311785750001,55.515784898,62.455258010249992,69.394731122500005,76.33420423474999]
[null,null,33.75,33.75,1.25,0.125,32.375,32.5,82.350999999999999,6.7816872009999996,13.563374401999999,20.345061603000001,27.126748803999998,33.908436004999999,40.690123206000003,47.471810407,54.253497607999996,61.035184808999993,67.816872009999997,74.598559210999994]
[null,null,{"$f":"D36","v":{"$error":"#REF!"}},{"$f":"#REF!-$F$8","v":{"$error":"#REF!"}},{"$f":"#REF!","v":{"$error":"#REF!"}},{"$f":"#REF!","v":{"$error":"#REF!"}},{"$f":"D36-E36-F36","v":{"$error":"#REF!"}},{"$error":"#REF!"},{"$error":"#REF!"},{"$f":"($I36*$I36*(J$17/1000))","v":{"$error":"#REF!"}},{"$error":"#REF!"},{"$error":"#REF!"},{"$error":"#REF!"},{"$error":"#REF!"},{"$error":"#REF!"},{"$error":"#REF!"},{"$error":"#REF!"},{"$error":"#REF!"},{"$error":"#REF!"},{"$error":"#REF!"}]
[null,null,{"$error":"#REF!"},{"$f":"D36-$F$8","v":{"$error":"#REF!"}},{"$f":"E36","v":{"$error":"#REF!"}},{"$error":"#REF!"},{"$f":"D37-E37-F37","v":{"$error":"#REF!"}},{"$f":"G37+F37","v":{"$error":"#REF!"}},{"$error":"#REF!"},{"$error":"#REF!"},{"$error":"#REF!"},{"$error":"#REF!"},{"$error":"#REF!"},{"$error":"#REF!"},{"$error":"#REF!"},{"$error":"#REF!"},{"$error":"#REF!"},{"$error":"#REF!"},{"$error":"#REF!"},{"$error":"#REF!"}]
[null,null,{"$error":"#REF!"},{"$error":"#REF!"},{"$error":"#REF!"},{"$error":"#REF!"},{"$f":"D38-E38-F38","v":{"$error":"#REF!"}},{"$f":"G38+F38","v":{"$error":"#REF!"}},{"$error":"#REF!"},{"$error":"#REF!"},{"$error":"#REF!"},{"$error":"#REF!"},{"$error":"#REF!"},{"$error":"#REF!"},{"$error":"#REF!"},{"$error":"#REF!"},{"$error":"#REF!"},{"$error":"#REF!"},{"$error":"#REF!"},{"$error":"#REF!"}]
[null,null,{"$error":"#REF!"},{"$error":"#REF!"},{"$error":"#REF!"},{"$error":"#REF!"},{"$error":"#REF!"},{"$error":"#REF!"},{"$error":"#REF!"},{"$error":"#REF!"},{"$error":"#REF!"},{"$error":"#REF!"},{"$error":"#REF!"},{"$error":"#REF!"},{"$error":"#REF!"},{"$error":"#REF!"},{"$error":"#REF!"},{"$error":"#REF!"},{"$error":"#REF!"},{"$error":"#REF!"}]
[null,null,{"$error":"#REF!"},{"$error":"#REF!"},{"$error":"#REF!"},{"$error":"#REF!"},{"$error":"#REF!"},{"$error":"#REF!"},{"$error":"#REF!"},{"$error":"#REF!"},{"$error":"#REF!"},{"$error":"#REF!"},{"$error":"#REF!"},{"$error":"#REF!"},{"$error":"#REF!"},{"$error":"#REF!"},{"$error":"#REF!"},{"$error":"#REF!"},{"$error":"#REF!"},{"$error":"#REF!"}]
[null,null,{"$error":"#REF!"},{"$error":"#REF!"},{"$error":"#REF!"},{"$error":"#REF!"},{"$error":"#REF!"},{"$error":"#REF!"},{"$error":"#REF!"},{"$error":"#REF!"},{"$error":"#REF!"},{"$error":"#REF!"},{"$error":"#REF!"},{"$error":"#REF!"},{"$error":"#REF!"},{"$error":"#REF!"},{"$error":"#REF!"},{"$error":"#REF!"},{"$error":"#REF!"},{"$error":"#REF!"}]
[null,null,{"$error":"#REF!"},{"$error":"#REF!"},{"$error":"#REF!"},{"$error":"#REF!"},{"$error":"#REF!"},{"$error":"#REF!"},{"$error":"#REF!"},{"$error":"#REF!"},{"$error":"#REF!"},{"$error":"#REF!"},{"$error":"#REF!"},{"$error":"#REF!"},{"$error":"#REF!"},{"$error":"#REF!"},{"$error":"#REF!"},{"$error":"#REF!"},{"$error":"#REF!"},{"$error":"#REF!"}]
[null,null,{"$error":"#REF!"},{"$error":"#REF!"},{"$error":"#REF!"},{"$error":"#REF!"},{"$error":"#REF!"},{"$error":"#REF!"},{"$error":"#REF!"},{"$error":"#REF!"},{"$error":"#REF!"},{"$error":"#REF!"},{"$error":"#REF!"},{"$error":"#REF!"},{"$error":"#REF!"},{"$error":"#REF!"},{"$error":"#REF!"},{"$error":"#REF!"},{"$error":"#REF!"},{"$error":"#REF!"}]
[null,null,{"$error":"#REF!"},{"$error":"#REF!"},{"$error":"#REF!"},{"$error":"#REF!"},{"$error":"#REF!"},{"$error":"#REF!"},{"$error":"#REF!"},{"$error":"#REF!"},{"$error":"#REF!"},{"$error":"#REF!"},{"$error":"#REF!"},{"$error":"#REF!"},{"$error":"#REF!"},{"$error":"#REF!"},{"$error":"#REF!"},{"$error":"#REF!"},{"$error":"#REF!"},{"$error":"#REF!"}]
[null,null,{"$error":"#REF!"},{"$error":"#REF!"},{"$error":"#REF!"},{"$error":"#REF!"},{"$error":"#REF!"},{"$error":"#REF!"},{"$error":"#REF!"},{"$error":"#REF!"},{"$error":"#REF!"},{"$error":"#REF!"},{"$error":"#REF!"},{"$error":"#REF!"},{"$error":"#REF!"},{"$error":"#REF!"},{"$error":"#REF!"},{"$error":"#REF!"},{"$error":"#REF!"},{"$error":"#REF!"}]
[null,null,{"$error":"#REF!"},{"$error":"#REF!"},{"$error":"#REF!"},{"$error":"#REF!"},{"$error":"#REF!"},{"$error":"#REF!"},{"$error":"#REF!"},{"$error":"#REF!"},{"$error":"#REF!"},{"$error":"#REF!"},{"$error":"#REF!"},{"$error":"#REF!"},{"$error":"#REF!"},{"$error":"#REF!"},{"$error":"#REF!"},{"$error":"#REF!"},{"$error":"#REF!"},{"$error":"#REF!"}]
[null,null,{"$error":"#REF!"},{"$error":"#REF!"},{"$error":"#REF!"},{"$error":"#REF!"},{"$error":"#REF!"},{"$error":"#REF!"},{"$error":"#REF!"},{"$error":"#REF!"},{"$error":"#REF!"},{"$error":"#REF!"},{"$error":"#REF!"},{"$error":"#REF!"},{"$error":"#REF!"},{"$error":"#REF!"},{"$error":"#REF!"},{"$error":"#REF!"},{"$error":"#REF!"},{"$error":"#REF!"}]
[null,null,{"$error":"#REF!"},{"$error":"#REF!"},{"$error":"#REF!"},{"$error":"#REF!"},{"$error":"#REF!"},{"$error":"#REF!"},{"$error":"#REF!"},{"$error":"#REF!"},{"$error":"#REF!"},{"$error":"#REF!"},{"$error":"#REF!"},{"$error":"#REF!"},{"$error":"#REF!"},{"$error":"#REF!"},{"$error":"#REF!"},{"$error":"#REF!"},{"$error":"#REF!"},{"$error":"#REF!"}]
[null,null,{"$error":"#REF!"},{"$error":"#REF!"},{"$error":"#REF!"},{"$error":"#REF!"},{"$error":"#REF!"},{"$error":"#REF!"},{"$error":"#REF!"},{"$error":"#REF!"},{"$error":"#REF!"},{"$error":"#REF!"},{"$error":"#REF!"},{"$error":"#REF!"},{"$error":"#REF!"},{"$error":"#REF!"},{"$error":"#REF!"},{"$error":"#REF!"},{"$error":"#REF!"},{"$error":"#REF!"}]
[null,null,{"$error":"#REF!"},{"$error":"#REF!"},{"$error":"#REF!"},{"$error":"#REF!"},{"$error":"#REF!"},{"$error":"#REF!"},{"$error":"#REF!"},{"$error":"#REF!"},{"$error":"#REF!"},{"$error":"#REF!"},{"$error":"#REF!"},{"$error":"#REF!"},{"$error":"#REF!"},{"$error":"#REF!"},{"$error":"#REF!"},{"$error":"#REF!"},{"$error":"#REF!"},{"$error":"#REF!"}]
[null,null,{"$error":"#REF!"},{"$error":"#REF!"},{"$error":"#REF!"},{"$error":"#REF!"},{"$error":"#REF!"},{"$error":"#REF!"},{"$error":"#REF!"},{"$f":"($I51*$I51*(J$17/1000))","v":{"$error":"#REF!"}},{"$error":"#REF!"},{"$error":"#REF!"},{"$error":"#REF!"},{"$error":"#REF!"},{"$error":"#REF!"},{"$error":"#REF!"},{"$error":"#REF!"},{"$error":"#REF!"},{"$error":"#REF!"},{"$error":"#REF!"}]
[null,null,{"$error":"#REF!"},{"$error":"#REF!"},{"$error":"#REF!"},{"$error":"#REF!"},{"$error":"#REF!"},{"$error":"#REF!"},{"$f":"(H52*2.54)-$T$117","v":{"$error":"#REF!"}},{"$error":"#REF!"},{"$error":"#REF!"},{"$error":"#REF!"},{"$error":"#REF!"},{"$error":"#REF!"},{"$error":"#REF!"},{"$error":"#REF!"},{"$error":"#REF!"},{"$error":"#REF!"},{"$error":"#REF!"},{"$error":"#REF!"}]
[null,null,{"$error":"#REF!"},{"$error":"#REF!"},{"$f":"E52","v":{"$error":"#REF!"}},{"$error":"#REF!"},{"$error":"#REF!"},{"$error":"#REF!"},{"$error":"#REF!"},{"$error":"#REF!"},{"$error":"#REF!"},{"$error":"#REF!"},{"$error":"#REF!"},{"$error":"#REF!"},{"$error":"#REF!"},{"$error":"#REF!"},{"$error":"#REF!"},{"$error":"#REF!"},{"$error":"#REF!"},{"$error":"#REF!"}]
[null,null,{"$error":"#REF!"},{"$error":"#REF!"},{"$error":"#REF!"},{"$error":"#REF!"},{"$error":"#REF!"},{"$error":"#REF!"},{"$error":"#REF!"},{"$error":"#REF!"},{"$error":"#REF!"},{"$error":"#REF!"},{"$error":"#REF!"},{"$error":"#REF!"},{"$error":"#REF!"},{"$error":"#REF!"},{"$error":"#REF!"},{"$error":"#REF!"},{"$error":"#REF!"},{"$error":"#REF!"}]
[null,null,{"$error":"#REF!"},{"$error":"#REF!"},{"$error":"#REF!"},{"$error":"#REF!"},{"$error":"#REF!"},{"$error":"#REF!"},{"$error":"#REF!"},{"$error":"#REF!"},{"$error":"#REF!"},{"$error":"#REF!"},{"$error":"#REF!"},{"$error":"#REF!"},{"$error":"#REF!"},{"$error":"#REF!"},{"$error":"#REF!"},{"$error":"#REF!"},{"$error":"#REF!"},{"$error":"#REF!"}]
[null,null,{"$error":"#REF!"},{"$error":"#REF!"},{"$error":"#REF!"},{"$error":"#REF!"},{"$error":"#REF!"},{"$error":"#REF!"},{"$error":"#REF!"},{"$error":"#REF!"},{"$error":"#REF!"},{"$error":"#REF!"},{"$error":"#REF!"},{"$error":"#REF!"},{"$error":"#REF!"},{"$error":"#REF!"},{"$error":"#REF!"},{"$error":"#REF!"},{"$error":"#REF!"},{"$error":"#REF!"}]
[null,null,{"$error":"#REF!"},{"$error":"#REF!"},{"$error":"#REF!"},{"$error":"#REF!"},{"$error":"#REF!"},{"$error":"#REF!"},{"$error":"#REF!"},{"$error":"#REF!"},{"$error":"#REF!"},{"$error":"#REF!"},{"$error":"#REF!"},{"$error":"#REF!"},{"$error":"#REF!"},{"$error":"#REF!"},{"$error":"#REF!"},{"$error":"#REF!"},{"$error":"#REF!"},{"$error":"#REF!"}]
[null,null,{"$error":"#REF!"},{"$error":"#REF!"},{"$error":"#REF!"},{"$error":"#REF!"},{"$error":"#REF!"},{"$error":"#REF!"},{"$error":"#REF!"},{"$error":"#REF!"},{"$error":"#REF!"},{"$error":"#REF!"},{"$error":"#REF!"},{"$error":"#REF!"},{"$error":"#REF!"},{"$error":"#REF!"},{"$error":"#REF!"},{"$error":"#REF!"},{"$error":"#REF!"},{"$error":"#REF!"}]
[null,null,{"$error":"#REF!"},{"$error":"#REF!"},{"$error":"#REF!"},{"$error":"#REF!"},{"$error":"#REF!"},{"$error":"#REF!"},{"$error":"#REF!"},{"$error":"#REF!"},{"$error":"#REF!"},{"$error":"#REF!"},{"$error":"#REF!"},{"$error":"#REF!"},{"$error":"#REF!"},{"$error":"#REF!"},{"$error":"#REF!"},{"$error":"#REF!"},{"$error":"#REF!"},{"$error":"#REF!"}]
[null,null,{"$error":"#REF!"},{"$error":"#REF!"},{"$error":"#REF!"},{"$error":"#REF!"},{"$error":"#REF!"},{"$error":"#REF!"},{"$error":"#REF!"},{"$error":"#REF!"},{"$error":"#REF!"},{"$error":"#REF!"},{"$error":"#REF!"},{"$error":"#REF!"},{"$error":"#REF!"},{"$error":"#REF!"},{"$error":"#REF!"},{"$error":"#REF!"},{"$error":"#REF!"},{"$error":"#REF!"}]
[null,null,{"$error":"#REF!"},{"$error":"#REF!"},{"$error":"#REF!"},{"$error":"#REF!"},{"$error":"#REF!"},{"$error":"#REF!"},{"$error":"#REF!"},{"$error":"#REF!"},{"$error":"#REF!"},{"$error":"#REF!"},{"$error":"#REF!"},{"$error":"#REF!"},{"$error":"#REF!"},{"$error":"#REF!"},{"$error":"#REF!"},{"$error":"#REF!"},{"$error":"#REF!"},{"$error":"#REF!"}]
[null,null,{"$error":"#REF!"},{"$error":"#REF!"},{"$error":"#REF!"},{"$error":"#REF!"},{"$error":"#REF!"},{"$error":"#REF!"},{"$error":"#REF!"},{"$error":"#REF!"},{"$error":"#REF!"},{"$error":"#REF!"},{"$error":"#REF!"},{"$error":"#REF!"},{"$error":"#REF!"},{"$error":"#REF!"},{"$error":"#REF!"},{"$error":"#REF!"},{"$error":"#REF!"},{"$error":"#REF!"}]
[null,null,{"$error":"#REF!"},{"$error":"#REF!"},{"$error":"#REF!"},{"$error":"#REF!"},{"$error":"#REF!"},{"$error":"#REF!"},{"$error":"#REF!"},{"$error":"#REF!"},{"$error":"#REF!"},{"$error":"#REF!"},{"$error":"#REF!"},{"$error":"#REF!"},{"$error":"#REF!"},{"$error":"#REF!"},{"$error":"#REF!"},{"$error":"#REF!"},{"$error":"#REF!"},{"$error":"#REF!"}]
[null,null,{"$error":"#REF!"},{"$error":"#REF!"},{"$error":"#REF!"},{"$error":"#REF!"},{"$error":"#REF!"},{"$error":"#REF!"},{"$error":"#REF!"},{"$error":"#REF!"},{"$error":"#REF!"},{"$error":"#REF!"},{"$error":"#REF!"},{"$error":"#REF!"},{"$error":"#REF!"},{"$error":"#REF!"},{"$error":"#REF!"},{"$error":"#REF!"},{"$error":"#REF!"},{"$error":"#REF!"}]
[null,null,{"$error":"#REF!"},{"$error":"#REF!"},{"$error":"#REF!"},{"$error":"#REF!"},{"$error":"#REF!"},{"$error":"#REF!"},{"$error":"#REF!"},{"$error":"#REF!"},{"$error":"#REF!"},{"$error":"#REF!"},{"$error":"#REF!"},{"$error":"#REF!"},{"$error":"#REF!"},{"$error":"#REF!"},{"$error":"#REF!"},{"$error":"#REF!"},{"$error":"#REF!"},{"$error":"#REF!"}]
[null,null,{"$error":"#REF!"},{"$error":"#REF!"},{"$error":"#REF!"},{"$error":"#REF!"},{"$error":"#REF!"},{"$error":"#REF!"},{"$error":"#REF!"},{"$error":"#REF!"},{"$error":"#REF!"},{"$error":"#REF!"},{"$error":"#REF!"},{"$error":"#REF!"},{"$error":"#REF!"},{"$error":"#REF!"},{"$error":"#REF!"},{"$error":"#REF!"},{"$error":"#REF!"},{"$error":"#REF!"}]
[null,null,{"$error":"#REF!"},{"$error":"#REF!"},{"$error":"#REF!"},{"$error":"#REF!"},{"$error":"#REF!"},{"$error":"#REF!"},{"$error":"#REF!"},{"$f":"($I67*$I67*(J$17/1000))","v":{"$error":"#REF!"}},{"$error":"#REF!"},{"$error":"#REF!"},{"$error":"#REF!"},{"$error":"#REF!"},{"$error":"#REF!"},{"$error":"#REF!"},{"$error":"#REF!"},{"$error":"#REF!"},{"$error":"#REF!"},{"$error":"#REF!"}]
[null,null,{"$error":"#REF!"},{"$error":"#REF!"},{"$error":"#REF!"},{"$error":"#REF!"},{"$error":"#REF!"},{"$error":"#REF!"},{"$error":"#REF!"},{"$error":"#REF!"},{"$error":"#REF!"},{"$error":"#REF!"},{"$error":"#REF!"},{"$error":"#REF!"},{"$error":"#REF!"},{"$error":"#REF!"},{"$error":"#REF!"},{"$error":"#REF!"},{"$error":"#REF!"},{"$error":"#REF!"}]
[null,null,{"$error":"#REF!"},{"$error":"#REF!"},{"$f":"E68","v":{"$error":"#REF!"}},{"$error":"#REF!"},{"$error":"#REF!"},{"$error":"#REF!"},{"$error":"#REF!"},{"$error":"#REF!"},{"$error":"#REF!"},{"$error":"#REF!"},{"$error":"#REF!"},{"$error":"#REF!"},{"$error":"#REF!"},{"$error":"#REF!"},{"$error":"#REF!"},{"$error":"#REF!"},{"$error":"#REF!"},{"$error":"#REF!"}]
[null,null,{"$error":"#REF!"},{"$error":"#REF!"},{"$error":"#REF!"},{"$error":"#REF!"},{"$error":"#REF!"},{"$error":"#REF!"},{"$error":"#REF!"},{"$error":"#REF!"},{"$error":"#REF!"},{"$error":"#REF!"},{"$error":"#REF!"},{"$error":"#REF!"},{"$error":"#REF!"},{"$error":"#REF!"},{"$error":"#REF!"},{"$error":"#REF!"},{"$error":"#REF!"},{"$error":"#REF!"}]
[null,null,{"$error":"#REF!"},{"$error":"#REF!"},{"$error":"#REF!"},{"$error":"#REF!"},{"$error":"#REF!"},{"$error":"#REF!"},{"$error":"#REF!"},{"$error":"#REF!"},{"$error":"#REF!"},{"$error":"#REF!"},{"$error":"#REF!"},{"$error":"#REF!"},{"$error":"#REF!"},{"$error":"#REF!"},{"$error":"#REF!"},{"$error":"#REF!"},{"$error":"#REF!"},{"$error":"#REF!"}]
[null,null,{"$error":"#REF!"},{"$error":"#REF!"},{"$error":"#REF!"},{"$error":"#REF!"},{"$error":"#REF!"},{"$error":"#REF!"},{"$error":"#REF!"},{"$error":"#REF!"},{"$error":"#REF!"},{"$error":"#REF!"},{"$error":"#REF!"},{"$error":"#REF!"},{"$error":"#REF!"},{"$error":"#REF!"},{"$error":"#REF!"},{"$error":"#REF!"},{"$error":"#REF!"},{"$error":"#REF!"}]
[null,null,{"$error":"#REF!"},{"$error":"#REF!"},{"$error":"#REF!"},{"$error":"#REF!"},{"$error":"#REF!"},{"$error":"#REF!"},{"$error":"#REF!"},{"$error":"#REF!"},{"$error":"#REF!"},{"$error":"#REF!"},{"$error":"#REF!"},{"$error":"#REF!"},{"$error":"#REF!"},{"$error":"#REF!"},{"$error":"#REF!"},{"$error":"#REF!"},{"$error":"#REF!"},{"$error":"#REF!"}]
[null,null,{"$error":"#REF!"},{"$error":"#REF!"},{"$error":"#REF!"},{"$error":"#REF!"},{"$error":"#REF!"},{"$error":"#REF!"},{"$error":"#REF!"},{"$error":"#REF!"},{"$error":"#REF!"},{"$error":"#REF!"},{"$error":"#REF!"},{"$error":"#REF!"},{"$error":"#REF!"},{"$error":"#REF!"},{"$error":"#REF!"},{"$error":"#REF!"},{"$error":"#REF!"},{"$error":"#REF!"}]
[null,null,{"$error":"#REF!"},{"$error":"#REF!"},{"$error":"#REF!"},{"$error":"#REF!"},{"$error":"#REF!"},{"$error":"#REF!"},{"$error":"#REF!"},{"$error":"#REF!"},{"$error":"#REF!"},{"$error":"#REF!"},{"$error":"#REF!"},{"$error":"#REF!"},{"$error":"#REF!"},{"$error":"#REF!"},{"$error":"#REF!"},{"$error":"#REF!"},{"$error":"#REF!"},{"$error":"#REF!"}]
[null,null,{"$error":"#REF!"},{"$error":"#REF!"},{"$error":"#REF!"},{"$error":"#REF!"},{"$error":"#REF!"},{"$error":"#REF!"},{"$error":"#REF!"},{"$error":"#REF!"},{"$error":"#REF!"},{"$error":"#REF!"},{"$error":"#REF!"},{"$error":"#REF!"},{"$error":"#REF!"},{"$error":"#REF!"},{"$error":"#REF!"},{"$error":"#REF!"},{"$error":"#REF!"},{"$error":"#REF!"}]
[null,null,{"$error":"#REF!"},{"$error":"#REF!"},{"$error":"#REF!"},{"$error":"#REF!"},{"$error":"#REF!"},{"$error":"#REF!"},{"$error":"#REF!"},{"$error":"#REF!"},{"$error":"#REF!"},{"$error":"#REF!"},{"$error":"#REF!"},{"$error":"#REF!"},{"$error":"#REF!"},{"$error":"#REF!"},{"$error":"#REF!"},{"$error":"#REF!"},{"$error":"#REF!"},{"$error":"#REF!"}]
[null,null,{"$error":"#REF!"},{"$error":"#REF!"},{"$error":"#REF!"},{"$error":"#REF!"},{"$error":"#REF!"},{"$error":"#REF!"},{"$error":"#REF!"},{"$error":"#REF!"},{"$error":"#REF!"},{"$error":"#REF!"},{"$error":"#REF!"},{"$error":"#REF!"},{"$error":"#REF!"},{"$error":"#REF!"},{"$error":"#REF!"},{"$error":"#REF!"},{"$error":"#REF!"},{"$error":"#REF!"}]
[null,null,{"$error":"#REF!"},{"$error":"#REF!"},{"$error":"#REF!"},{"$error":"#REF!"},{"$error":"#REF!"},{"$error":"#REF!"},{"$error":"#REF!"},{"$error":"#REF!"},{"$error":"#REF!"},{"$error":"#REF!"},{"$error":"#REF!"},{"$error":"#REF!"},{"$error":"#REF!"},{"$error":"#REF!"},{"$error":"#REF!"},{"$error":"#REF!"},{"$error":"#REF!"},{"$error":"#REF!"}]
[null,null,{"$error":"#REF!"},{"$error":"#REF!"},{"$error":"#REF!"},{"$error":"#REF!"},{"$error":"#REF!"},{"$error":"#REF!"},{"$error":"#REF!"},{"$error":"#REF!"},{"$error":"#REF!"},{"$error":"#REF!"},{"$error":"#REF!"},{"$error":"#REF!"},{"$error":"#REF!"},{"$error":"#REF!"},{"$error":"#REF!"},{"$error":"#REF!"},{"$error":"#REF!"},{"$error":"#REF!"}]
[null,null,{"$error":"#REF!"},{"$error":"#REF!"},{"$error":"#REF!"},{"$error":"#REF!"},{"$error":"#REF!"},{"$error":"#REF!"},{"$error":"#REF!"},{"$error":"#REF!"},{"$error":"#REF!"},{"$error":"#REF!"},{"$error":"#REF!"},{"$error":"#REF!"},{"$error":"#REF!"},{"$error":"#REF!"},{"$error":"#REF!"},{"$error":"#REF!"},{"$error":"#REF!"},{"$error":"#REF!"}]
[null,null,{"$error":"#REF!"},{"$error":"#REF!"},{"$error":"#REF!"},{"$error":"#REF!"},{"$error":"#REF!"},{"$error":"#REF!"},{"$error":"#REF!"},{"$error":"#REF!"},{"$error":"#REF!"},{"$error":"#REF!"},{"$error":"#REF!"},{"$error":"#REF!"},{"$error":"#REF!"},{"$error":"#REF!"},{"$error":"#REF!"},{"$error":"#REF!"},{"$error":"#REF!"},{"$error":"#REF!"}]
[null,null,{"$error":"#REF!"},{"$error":"#REF!"},{"$error":"#REF!"},{"$error":"#REF!"},{"$error":"#REF!"},{"$error":"#REF!"},{"$error":"#REF!"},{"$f":"($I83*$I83*(J$17/1000))","v":{"$error":"#REF!"}},{"$error":"#REF!"},{"$error":"#REF!"},{"$error":"#REF!"},{"$error":"#REF!"},{"$error":"#REF!"},{"$error":"#REF!"},{"$error":"#REF!"},{"$error":"#REF!"},{"$error":"#REF!"},{"$error":"#REF!"}]
[null,null,{"$error":"#REF!"},{"$error":"#REF!"},{"$error":"#REF!"},{"$error":"#REF!"},{"$error":"#REF!"},{"$error":"#REF!"},{"$f":"(H84*2.54)-$T$117","v":{"$error":"#REF!"}},{"$error":"#REF!"},{"$error":"#REF!"},{"$error":"#REF!"},{"$error":"#REF!"},{"$error":"#REF!"},{"$error":"#REF!"},{"$error":"#REF!"},{"$error":"#REF!"},{"$error":"#REF!"},{"$error":"#REF!"},{"$error":"#REF!"}]
[null,null,{"$error":"#REF!"},{"$error":"#REF!"},{"$f":"E84","v":{"$error":"#REF!"}},{"$error":"#REF!"},{"$error":"#REF!"},{"$error":"#REF!"},{"$error":"#REF!"},{"$error":"#REF!"},{"$error":"#REF!"},{"$error":"#REF!"},{"$error":"#REF!"},{"$error":"#REF!"},{"$error":"#REF!"},{"$error":"#REF!"},{"$error":"#REF!"},{"$error":"#REF!"},{"$error":"#REF!"},{"$error":"#REF!"}]
[null,null,{"$error":"#REF!"},{"$error":"#REF!"},{"$error":"#REF!"},{"$error":"#REF!"},{"$error":"#REF!"},{"$error":"#REF!"},{"$error":"#REF!"},{"$error":"#REF!"},{"$error":"#REF!"},{"$error":"#REF!"},{"$error":"#REF!"},{"$error":"#REF!"},{"$error":"#REF!"},{"$error":"#REF!"},{"$error":"#REF!"},{"$error":"#REF!"},{"$error":"#REF!"},{"$error":"#REF!"}]
[null,null,{"$error":"#REF!"},{"$error":"#REF!"},{"$error":"#REF!"},{"$error":"#REF!"},{"$error":"#REF!"},{"$error":"#REF!"},{"$error":"#REF!"},{"$error":"#REF!"},{"$error":"#REF!"},{"$error":"#REF!"},{"$error":"#REF!"},{"$error":"#REF!"},{"$error":"#REF!"},{"$error":"#REF!"},{"$error":"#REF!"},{"$error":"#REF!"},{"$error":"#REF!"},{"$error":"#REF!"}]
[null,null,{"$error":"#REF!"},{"$error":"#REF!"},{"$error":"#REF!"},{"$error":"#REF!"},{"$error":"#REF!"},{"$error":"#REF!"},{"$error":"#REF!"},{"$error":"#REF!"},{"$error":"#REF!"},{"$error":"#REF!"},{"$error":"#REF!"},{"$error":"#REF!"},{"$error":"#REF!"},{"$error":"#REF!"},{"$error":"#REF!"},{"$error":"#REF!"},{"$error":"#REF!"},{"$error":"#REF!"}]
[null,null,{"$error":"#REF!"},{"$error":"#REF!"},{"$error":"#REF!"},{"$error":"#REF!"},{"$error":"#REF!"},{"$error":"#REF!"},{"$error":"#REF!"},{"$error":"#REF!"},{"$error":"#REF!"},{"$error":"#REF!"},{"$error":"#REF!"},{"$error":"#REF!"},{"$error":"#REF!"},{"$error":"#REF!"},{"$error":"#REF!"},{"$error":"#REF!"},{"$error":"#REF!"},{"$error":"#REF!"}]
[null,null,{"$error":"#REF!"},{"$error":"#REF!"},{"$error":"#REF!"},{"$error":"#REF!"},{"$error":"#REF!"},{"$error":"#REF!"},{"$error":"#REF!"},{"$error":"#REF!"},{"$error":"#REF!"},{"$error":"#REF!"},{"$error":"#REF!"},{"$error":"#REF!"},{"$error":"#REF!"},{"$error":"#REF!"},{"$error":"#REF!"},{"$error":"#REF!"},{"$error":"#REF!"},{"$error":"#REF!"}]
[null,null,{"$error":"#REF!"},{"$error":"#REF!"},{"$error":"#REF!"},{"$error":"#REF!"},{"$error":"#REF!"},{"$error":"#REF!"},{"$error":"#REF!"},{"$error":"#REF!"},{"$error":"#REF!"},{"$error":"#REF!"},{"$error":"#REF!"},{"$error":"#REF!"},{"$error":"#REF!"},{"$error":"#REF!"},{"$error":"#REF!"},{"$error":"#REF!"},{"$error":"#REF!"},{"$error":"#REF!"}]
[null,null,{"$error":"#REF!"},{"$error":"#REF!"},{"$error":"#REF!"},{"$error":"#REF!"},{"$error":"#REF!"},{"$error":"#REF!"},{"$error":"#REF!"},{"$error":"#REF!"},{"$error":"#REF!"},{"$error":"#REF!"},{"$error":"#REF!"},{"$error":"#REF!"},{"$error":"#REF!"},{"$error":"#REF!"},{"$error":"#REF!"},{"$error":"#REF!"},{"$error":"#REF!"},{"$error":"#REF!"}]
[null,null,{"$error":"#REF!"},{"$error":"#REF!"},{"$error":"#REF!"},{"$error":"#REF!"},{"$error":"#REF!"},{"$error":"#REF!"},{"$error":"#REF!"},{"$error":"#REF!"},{"$error":"#REF!"},{"$error":"#REF!"},{"$error":"#REF!"},{"$error":"#REF!"},{"$error":"#REF!"},{"$error":"#REF!"},{"$error":"#REF!"},{"$error":"#REF!"},{"$error":"#REF!"},{"$error":"#REF!"}]
[null,null,{"$error":"#REF!"},{"$error":"#REF!"},{"$error":"#REF!"},{"$error":"#REF!"},{"$error":"#REF!"},{"$error":"#REF!"},{"$error":"#REF!"},{"$error":"#REF!"},{"$error":"#REF!"},{"$error":"#REF!"},{"$error":"#REF!"},{"$error":"#REF!"},{"$error":"#REF!"},{"$error":"#REF!"},{"$error":"#REF!"},{"$error":"#REF!"},{"$error":"#REF!"},{"$error":"#REF!"}]
[null,null,{"$error":"#REF!"},{"$error":"#REF!"},{"$error":"#REF!"},{"$error":"#REF!"},{"$error":"#REF!"},{"$error":"#REF!"},{"$error":"#REF!"},{"$error":"#REF!"},{"$error":"#REF!"},{"$error":"#REF!"},{"$error":"#REF!"},{"$error":"#REF!"},{"$error":"#REF!"},{"$error":"#REF!"},{"$error":"#REF!"},{"$error":"#REF!"},{"$error":"#REF!"},{"$error":"#REF!"}]
[null,null,{"$error":"#REF!"},{"$error":"#REF!"},{"$error":"#REF!"},{"$error":"#REF!"},{"$error":"#REF!"},{"$error":"#REF!"},{"$error":"#REF!"},{"$error":"#REF!"},{"$error":"#REF!"},{"$error":"#REF!"},{"$error":"#REF!"},{"$error":"#REF!"},{"$error":"#REF!"},{"$error":"#REF!"},{"$error":"#REF!"},{"$error":"#REF!"},{"$error":"#REF!"},{"$error":"#REF!"}]
[null,null,{"$error":"#REF!"},{"$error":"#REF!"},{"$error":"#REF!"},{"$error":"#REF!"},{"$error":"#REF!"},{"$error":"#REF!"},{"$error":"#REF!"},{"$error":"#REF!"},{"$error":"#REF!"},{"$error":"#REF!"},{"$error":"#REF!"},{"$error":"#REF!"},{"$error":"#REF!"},{"$error":"#REF!"},{"$error":"#REF!"},{"$error":"#REF!"},{"$error":"#REF!"},{"$error":"#REF!"}]
[null,null,{"$error":"#REF!"},{"$error":"#REF!"},{"$error":"#REF!"},{"$error":"#REF!"},{"$error":"#REF!"},{"$error":"#REF!"},{"$error":"#REF!"},{"$error":"#REF!"},{"$error":"#REF!"},{"$error":"#REF!"},{"$error":"#REF!"},{"$error":"#REF!"},{"$error":"#REF!"},{"$error":"#REF!"},{"$error":"#REF!"},{"$error":"#REF!"},{"$error":"#REF!"},{"$error":"#REF!"}]
[null,null,{"$error":"#REF!"},{"$error":"#REF!"},{"$error":"#REF!"},{"$error":"#REF!"},{"$error":"#REF!"},{"$error":"#REF!"},{"$error":"#REF!"},{"$f":"($I99*$I99*(J$17/1000))","v":{"$error":"#REF!"}},{"$error":"#REF!"},{"$error":"#REF!"},{"$error":"#REF!"},{"$error":"#REF!"},{"$error":"#REF!"},{"$error":"#REF!"},{"$error":"#REF!"},{"$error":"#REF!"},{"$error":"#REF!"},{"$error":"#REF!"}]
[null,null,{"$f":"D100","v":{"$error":"#REF!"}},{"$error":"#REF!"},{"$error":"#REF!"},{"$error":"#REF!"},{"$error":"#REF!"},{"$error":"#REF!"},{"$error":"#REF!"},{"$error":"#REF!"},{"$error":"#REF!"},{"$error":"#REF!"},{"$error":"#REF!"},{"$error":"#REF!"},{"$error":"#REF!"},{"$error":"#REF!"},{"$error":"#REF!"},{"$error":"#REF!"},{"$error":"#REF!"},{"$error":"#REF!"}]
[null,null,{"$error":"#REF!"},{"$f":"D100-$F$8","v":{"$error":"#REF!"}},{"$f":"E100","v":{"$error":"#REF!"}},{"$error":"#REF!"},{"$error":"#REF!"},{"$error":"#REF!"},{"$error":"#REF!"},{"$error":"#REF!"},{"$error":"#REF!"},{"$error":"#REF!"},{"$error":"#REF!"},{"$error":"#REF!"},{"$error":"#REF!"},{"$error":"#REF!"},{"$error":"#REF!"},{"$error":"#REF!"},{"$error":"#REF!"},{"$error":"#REF!"}]
[null,null,{"$error":"#REF!"},{"$error":"#REF!"},{"$error":"#REF!"},{"$error":"#REF!"},{"$f":"D102-E102-F102","v":{"$error":"#REF!"}},{"$f":"G102+F102","v":{"$error":"#REF!"}},{"$error":"#REF!"},{"$error":"#REF!"},{"$error":"#REF!"},{"$error":"#REF!"},{"$error":"#REF!"},{"$error":"#REF!"},{"$error":"#REF!"},{"$error":"#REF!"},{"$error":"#REF!"},{"$error":"#REF!"},{"$error":"#REF!"},{"$error":"#REF!"}]
[null,null,{"$error":"#REF!"},{"$error":"#REF!"},{"$error":"#REF!"},{"$error":"#REF!"},{"$error":"#REF!"},{"$error":"#REF!"},{"$error":"#REF!"},{"$error":"#REF!"},{"$error":"#REF!"},{"$error":"#REF!"},{"$error":"#REF!"},{"$error":"#REF!"},{"$error":"#REF!"},{"$error":"#REF!"},{"$error":"#REF!"},{"$error":"#REF!"},{"$error":"#REF!"},{"$error":"#REF!"}]
[null,null,{"$error":"#REF!"},{"$error":"#REF!"},{"$error":"#REF!"},{"$error":"#REF!"},{"$error":"#REF!"},{"$error":"#REF!"},{"$error":"#REF!"},{"$error":"#REF!"},{"$error":"#REF!"},{"$error":"#REF!"},{"$error":"#REF!"},{"$error":"#REF!"},{"$error":"#REF!"},{"$error":"#REF!"},{"$error":"#REF!"},{"$error":"#REF!"},{"$error":"#REF!"},{"$error":"#REF!"}]
[null,null,{"$error":"#REF!"},{"$error":"#REF!"},{"$error":"#REF!"},{"$error":"#REF!"},{"$error":"#REF!"},{"$error":"#REF!"},{"$error":"#REF!"},{"$error":"#REF!"},{"$error":"#REF!"},{"$error":"#REF!"},{"$error":"#REF!"},{"$error":"#REF!"},{"$error":"#REF!"},{"$error":"#REF!"},{"$error":"#REF!"},{"$error":"#REF!"},{"$error":"#REF!"},{"$error":"#REF!"}]
[null,null,{"$error":"#REF!"},{"$error":"#REF!"},{"$error":"#REF!"},{"$error":"#REF!"},{"$error":"#REF!"},{"$error":"#REF!"},{"$error":"#REF!"},{"$error":"#REF!"},{"$error":"#REF!"},{"$error":"#REF!"},{"$error":"#REF!"},{"$error":"#REF!"},{"$error":"#REF!"},{"$error":"#REF!"},{"$error":"#REF!"},{"$error":"#REF!"},{"$error":"#REF!"},{"$error":"#REF!"}]
[null,null,{"$error":"#REF!"},{"$error":"#REF!"},{"$error":"#REF!"},{"$error":"#REF!"},{"$error":"#REF!"},{"$error":"#REF!"},{"$error":"#REF!"},{"$error":"#REF!"},{"$error":"#REF!"},{"$error":"#REF!"},{"$error":"#REF!"},{"$error":"#REF!"},{"$error":"#REF!"},{"$error":"#REF!"},{"$error":"#REF!"},{"$error":"#REF!"},{"$error":"#REF!"},{"$error":"#REF!"}]
[]
[]
[]
[]
[]
[]
[]
[null,null,null,null,null,null,null,null,0,{"$f":"DataBase!C3","v":1},{"$f":"DataBase!D3","v":2},{"$f":"DataBase!E3","v":3},{"$f":"DataBase!F3","v":4},{"$f":"DataBase!G3","v":5},{"$f":"DataBase!H3","v":6},{"$f":"DataBase!I3","v":7},{"$f":"DataBase!J3","v":8},{"$f":"DataBase!K3","v":9},{"$f":"DataBase!L3","v":10},"Grams"]
[null,null,null,null,null,null,null,null,0,{"$f":"DataBase!C4","v":3.98},{"$f":"DataBase!D4","v":5.74},{"$f":"DataBase!E4","v":8.3000000000000007},{"$f":"DataBase!F4","v":10.9},{"$f":"DataBase!G4","v":13.5},{"$f":"DataBase!H4","v":16.100000000000001},{"$f":"DataBase!I4","v":18.7},{"$f":"DataBase!J4","v":21.2},{"$f":"DataBase!K4","v":23.9},{"$f":"DataBase!L4","v":26.3}," mm"]
[null,null,null,null,null,null,null,null,null,{"$f":"DataBase!C5","v":0},{"$f":"DataBase!D5","v":0},{"$f":"DataBase!E5","v":0},{"$f":"DataBase!F5","v":0},{"$f":"DataBase!G5","v":0},{"$f":"DataBase!H5","v":0},{"$f":"DataBase!I5","v":0},{"$f":"DataBase!J5","v":0},{"$f":"DataBase!K5","v":0},{"$f":"DataBase!L5","v":0},{"$f":"LOOKUP(J13,I115:R115,I118:R118)","v":0.19900000000000001}]
[null,null,null,null,null,null,null,null,0,{"$f":"DataBase!C6","v":0.19900000000000001},{"$f":"DataBase!D6","v":0.28700000000000003},{"$f":"DataBase!E6","v":0.41500000000000004},{"$f":"DataBase!F6","v":0.54500000000000004},{"$f":"DataBase!G6","v":0.67500000000000004},{"$f":"DataBase!H6","v":0.80500000000000005},{"$f":"DataBase!I6","v":0.93499999999999994},{"$f":"DataBase!J6","v":1.06},{"$f":"DataBase!K6","v":1.1949999999999998},{"$f":"DataBase!L6","v":1.3149999999999999},"BT corr"]

{"sheet":"DataBase","index":2,"n_rows":24,"n_cols":14,"rows_kept":24,"cut":false,"hidden":true,"merged":[[1,1,1,12],[8,0,9,4]]}
[]
[null,"TIP WEIGHT SPECS"]
[null,0,1,2,3,4,5,6,7,8,9,10,"Grams"]
[null,0,3.98,5.74,8.3000000000000007,10.9,13.5,16.100000000000001,18.7,21.2,23.9,26.3," mm"]
[null,null,null,null,null,null,null,null,null,null,null,null,{"$f":"LOOKUP('MOI DRY FIT METRIC'!J17,B3:K3,B6:K6)","v":0.41500000000000004},"Formula error"]
[null,0,{"$f":"(C4/2)/10","v":0.19900000000000001},0.28700000000000003,0.41500000000000004,0.54500000000000004,0.67500000000000004,0.80500000000000005,0.93499999999999994,1.06,1.1949999999999998,1.3149999999999999,"BT corr"]
[]
[]
["SW PROGRESSION PR INCH"]
[]
["MOI - 1.33 SWP / INCH",1.32,1,1,{"$f":"LOOKUP(D11,C11:C24,B11:B24)","v":1.32}]
["1.2 SWP / INCH",{"$f":"1.2","v":1.2},{"$f":"C11+1","v":2}]
["1.1 SWP / INCH",{"$f":"B12-0.1","v":1.0999999999999999},{"$f":"C12+1","v":3}]
["DIY - 1.0 SWP / INCH",{"$f":"B13-0.1","v":0.99999999999999989},4]
["0.9 SWP / INCH",0.89999999999999991,5]
["4\" FULCRUM - 0.8 SWP INCH",0.79999999999999993,6]
["0.7 SWP / INCH",0.7,7]
["0.6 SWP / INCH",0.6,8]
["0.5 SWP / INCH",0.5,9]
["0.4 SWP / INCH",0.4,10]
["0.3 SWP / INCH",0.30000000000000004,11]
["0.2 SWP / INCH",0.20000000000000004,12]
["0.1 SWP / INCH",0.10000000000000003,13]
["FLAT SW - CLASSIC",0,14]

{"sheet":"MOI DRY FIT METRIC","index":3,"n_rows":112,"n_cols":37,"rows_kept":112,"cut":false,"hidden":false,"merged":[[93,13,93,15],[94,13,94,15],[85,2,85,4],[105,6,105,8],[104,6,104,8],[96,6,96,8],[97,6,97,8],[91,2,91,4],[92,2,92,4],[87,3,87,4],[87,9,87,11],[87,13,87,14],[74,6,74,7],[75,6,75,7],[76,6,76,7],[77,6,77,7],[78,6,78,7],[79,6,79,7],[80,6,80,7],[93,4,93,5],[93,1,93,2],[88,1,89,1],[88,2,89,4],[88,5,89,5],[90,2,90,4],[106,6,106,8],[103,6,103,19],[109,1,109,5],[109,6,109,8],[110,1,110,5],[110,6,110,8],[98,6,98,8],[107,1,107,5],[107,6,107,8],[108,1,108,5],[108,6,108,8],[101,7,101,8],[102,6,102,8],[99,6,99,8],[100,7,100,8],[87,16,87,17],[86,2,86,4],[0,12,0,15],[58,6,58,7],[59,6,59,7],[60,6,60,7],[6,2,6,4],[8,3,8,4],[37,6,37,7],[47,6,47,8],[48,6,48,8],[49,6,49,8],[7,2,7,4],[11,2,11,4],[18,1,19,3],[81,6,81,7],[72,6,72,7],[73,6,73,7],[69,6,69,7],[70,6,70,7],[71,6,71,7],[66,6,66,7],[61,6,61,7],[62,6,62,7],[67,6,67,7],[68,6,68,7],[5,9,5,11],[5,13,5,14],[5,16,5,17],[47,1,47,2],[48,1,48,2],[35,6,35,8],[49,1,49,2],[40,7,40,8],[41,6,41,8],[18,6,19,8],[46,1,46,5],[46,6,46,8],[9,5,10,5],[38,6,38,8],[36,6,36,8],[18,4,19,4],[9,2,10,4],[18,5,19,5],[9,1,10,1],[12,2,12,4],[15,2,15,4],[16,2,16,4],[16,5,16,6],[13,2,13,4],[12,5,12,6],[63,6,63,7],[64,6,64,7],[65,6,65,7],[56,6,56,8],[55,6,55,8],[16,14,16,16],[16,11,16,13],[45,6,45,8],[42,6,42,19],[47,3,47,4],[14,15,14,19],[33,15,33,19],[39,6,39,8],[48,3,48,4],[49,3,49,4],[43,6,43,8],[44,6,44,8]]}
[null,null,null,null,null,null,null,null,null,null,null,null,"SW TUNER",null,null,null,{"$f":"IF(Q2 <>1000,(Q2-1000)/10,\"0\")","v":"0"},{"$f":"IF(R2 <>1000,(R2-1000)/10,\"0\")","v":"0"},{"$f":"IF(S2 <>1000,(S2-1000)/10,\"0\")","v":"0"},{"$f":"IF(T2 <>1000,(T2-1000)/10,\"0\")","v":"0"}]
[null,null,"PLAY LENGTH",null,"BAL.POINT ","TOTAL",null,"WEDGE",null,"#3 IRON","WEDGE","IRON",35.869999999999997,null,null,null,1000,1000,1000,1000]
[null,"FRACTION","INDEX",null,"SPINNER","SPINNER",null,"MOI",null,"PLAY MM","L - DIFF","L - DIFF",null,null,1000,null,1000,1000,1000,1000]
[null,1,13,null,7390,4116,5,true,null,924,63,95,null,null,30,{"$f":"O4/10","v":3},{"$f":"IF(Q3<>1000,(Q3/20)-50,\"0\")","v":"0"},{"$f":"IF(R3<>1000,(R3/20)-50,\"0\")","v":"0"},"0","0"]
[]
[null,null,"1/8\"","1/16\"","1/32\"","1,00\"",null,null,"NAME",null,null,null,"HEADS",null,null,"SHAFTS",null,null,"SET UP",null," gw"]
[]
[null,{"$f":"F8/25.4","v":0.12598425196850396},"GRIP CAP THICKNESS",null,null,3.2,null,null,"inch",{"$f":"J10/25.4","v":0.4375},{"$f":"K10/25.4","v":0.40625},0.37499999999999994,0.34375,0.3125,0.28125,0.25,0.21875,0.18749999999999997,0.15625,{"$f":"T10/25.4","v":0.125},null,null,null,null,null,null,null,null,null,null,null,null,null,null,null,null,25]
[null,{"$f":"F9/25.4","v":1.2519685039370079},{"$f":"G9/25.4","v":1.6259842519685039},"BBGM - IRON - WEDGE",null,31.8,41.3,null,"inch",0.4375,0.40625,0.375,0.34375,0.3125,0.28125,0.25,0.21875,0.1875,0.15625,0.125]
[null,{"$f":"F10/25.4","v":0.37401574803149606},"LENGTH BETWEEN IRONS",null,null,{"$f":"L4/10","v":9.5},null,null,"INCH/MM",{"$f":"J9*25.4","v":11.112499999999999},{"$f":"K9*25.4","v":10.31875},9.5249999999999986,8.7312499999999993,7.9375,7.1437499999999998,6.35,5.5562499999999995,4.7624999999999993,3.96875,3.1749999999999998]
[null,null,null,null,null,null,null,null,"#2","#3","#4","#5","#6","#7","#8","#9",{"$f":"IF(Q2=1000,\"PW\",Q1)","v":"PW"},{"$f":"IF(R2=1000,\"GW\",R1)","v":"GW"},{"$f":"IF(S2=1000,\"SW\",S1)","v":"SW"},{"$f":"IF(T2=1000,\"LW\",T1)","v":"LW"}]
[null,{"$f":"F12/25.4","v":0.24803149606299213},"LENGTH BETWEEN WEDGES",null,null,{"$f":"K4/10","v":6.3},null,null,{"$f":"PRINT!I6","v":0.5},{"$f":"39+F61","v":39.5},{"$f":"J12-0.5","v":39},38.5,38,37.5,37,36.5,{"$f":"P12-0.25","v":36.25},{"$f":"Q12-0.25","v":36},{"$f":"R12-0.25","v":35.75},{"$f":"S12-0.25","v":35.5}]
[null,"IMPERIAL",null,null,null,"#8 IRON - METRIC",null,null,"THIS SET",{"$f":"C22/2.54","v":38.248031496063},{"$f":"C23/2.54","v":37.874015748031503},{"$f":"C24/2.54","v":37.500000000000007},{"$f":"C25/2.54","v":37.125984251968511},{"$f":"C26/2.54","v":36.751968503937007},{"$f":"C27/2.54","v":36.377952755905511},{"$f":"C28/2.54","v":36.003937007874015},{"$f":"(C29)/2.54","v":35.755905511811029},{"$f":"(C30)/2.54","v":35.507874015748037},{"$f":"(C31)/2.54","v":35.259842519685044},{"$f":"(C32)/2.54","v":35.011811023622052}]
[null,{"$f":"F14/2.54","v":36.377952755905511},null,null,null,{"$f":"J4/10","v":92.4},null,null,"DIFF",{"$f":"J13-J12","v":-1.2519685039370003},-1.1259842519684966,-0.99999999999999289,-0.87401574803148918,-0.74803149606299257,-0.62204724409448886,-0.49606299212598515,-0.49409448818897062,-0.49212598425196319,-0.49015748031495576,-0.48818897637794834]
[null,null,"IRONS SWP","STD.SW","WEDGE SWP",null,null,null,null,null,null,null,null,null,null,"WEDGE PLAY LENGTH TUNER"]
[null,null,"MOI-POINTS TO ADD",null,null,29.5]
[null,null,"NEEDED WEIGTH IN GRAMS",null,null,{"$f":"F16/R17","v":3.1450153239539009},null,null,"Grams",3.02,6.5000000000000002E-2,"LIGHTEST TIP W.-TIP W PROG.",null,null,"MOI points pr gram at this lenght",null,null,{"$f":"((U22*U22)*1)/1000","v":9.3799225000000046},"Gr.MOI-P",{"$f":"R17/100","v":9.3799225000000042E-2}]
[]
[null,"SW PROGRESSION BETW.CLUBS",null,null,{"$f":"(1.33/25.4)*F10","v":0.49744094488188978},{"$f":"(1.33/25.4)*F12","v":0.32988188976377952},"SW PROG. WEDGES",null,null,"Grams","Grams","Grams","Grams","Grams","Grams","Grams","Grams","Grams","Grams","Grams"]
[null,null,null,null,null,null,null,null,null,{"$f":"J17","v":3.02},{"$f":"J20+K17","v":3.085},{"$f":"K20+K17","v":3.15},{"$f":"L20+K17","v":3.2149999999999999},{"$f":"M20+K17","v":3.28},{"$f":"N20+K17","v":3.3449999999999998},{"$f":"O20+K17","v":3.4099999999999997},{"$f":"P20+K17","v":3.4749999999999996},{"$f":"Q20+K17","v":3.5399999999999996},{"$f":"R20+K17","v":3.6049999999999995},{"$f":"S20+K17","v":3.6699999999999995}]
[null,"CLUB SW+","METRIC","Play lenght","Net shaft",null,null,null,null,"MOI Points","MOI Points","MOI Points","MOI Points","MOI Points","MOI Points","MOI Points","MOI Points","MOI Points","MOI Points","MOI Points","Butt to tip",null,null,null,null,null,null,null,null,null,null,null,null,"Butt-tip Cm"]
[null,"#3",{"$f":"C23+($F$10/10)","v":97.15000000000002},{"$f":"C22/2.54","v":38.248031496063},{"$f":"C22-($F$9/10)-($F$8/10)","v":93.65000000000002},null,36.5,{"$f":"G22*2.54","v":92.710000000000008},null,{"$f":"($U22*$U22*(J$20/1000))","v":28.327365950000015},28.937060912500012,29.546755875000013,30.156450837500014,30.766145800000015,31.375840762500012,31.985535725000013,32.595230687500013,33.204925650000014,33.814620612500015,34.424315575000016,{"$f":"E22+($F$8)","v":96.850000000000023},null,null,"gram","mm","pr mm","Just MM","BT Just",null,null,"Matt",null,null,{"$f":"(U22*2.54)-DataBase!$M$5","v":245.58400000000006}]
[null,"#4",{"$f":"C24+($F$10/10)","v":96.200000000000017},{"$f":"C23/2.54","v":37.874015748031503},92.700000000000017,null,null,null,null,27.77436620000001,28.372158850000009,28.969951500000011,29.56774415000001,30.165536800000009,30.763329450000008,31.36112210000001,31.958914750000009,32.556707400000008,33.15450005000001,33.752292700000005,{"$f":"E23+($F$8)","v":95.90000000000002},null,10,9.8000000000000007,25.8,{"$f":"Y23/X23","v":2.6326530612244898},{"$f":"(Y23/X23)*W23","v":26.326530612244898},{"$f":"AA23/2","v":13.163265306122449},null,null,{"$f":"AA23","v":26.326530612244898},null,null,{"$f":"(U23*2.54)-DataBase!$M$5","v":243.17100000000005}]
[null,"#5",{"$f":"C25+($F$10/10)","v":95.250000000000014},37.500000000000007,91.750000000000014,null,null,null,null,27.226817550000014,27.812825212500012,28.398832875000014,28.984840537500013,29.570848200000015,30.156855862500013,30.742863525000011,31.328871187500013,31.914878850000012,32.50088651250001,33.086894175000012,94.950000000000017,null,9,8.8000000000000007,23.1,{"$f":"Y24/X24","v":2.625},{"$f":"(Y24/X24)*W24","v":23.625},{"$f":"AA24/2","v":11.8125},null,null,{"$f":"AA23-2.4","v":23.9265306122449},null,null,{"$f":"(U24*2.54)-DataBase!$M$5","v":240.75800000000007}]
[null,"#6",{"$f":"C26+($F$10/10)","v":94.300000000000011},37.125984251968511,90.800000000000011,null,null,null,null,26.684720000000006,27.259060000000005,27.833400000000005,28.407740000000004,28.982080000000007,29.556420000000006,30.130760000000006,30.705100000000005,31.279440000000005,31.853780000000004,32.428120000000007,94.000000000000014,null,8,7.8,20.6,2.6410256410256414,21.128205128205131,10.564102564102566,null," ",{"$f":"AA24-2.4","v":21.225000000000001}," "," ",{"$f":"(U25*2.54)-DataBase!$M$5","v":238.34500000000006}]
[null,"#7",{"$f":"C27+($F$10/10)","v":93.350000000000009},36.751968503937007,89.850000000000009,null,null,null,null,26.148073550000007,26.710863212500005,27.273652875000007,27.836442537500005,28.399232200000004,28.962021862500006,29.524811525000004,30.087601187500002,30.650390850000004,31.213180512500003,31.775970175000001,93.050000000000011,null,7,6.8,18,2.6470588235294117,18.52941176470588,9.2647058823529402,null,null,18.728205128205133,null,null,{"$f":"(U26*2.54)-DataBase!$M$5","v":235.93200000000004}]
[null,"#8",{"$f":"F14","v":92.4},36.377952755905511,88.9,null,null,null,null,25.616878200000006,26.168234850000005,26.719591500000007,27.270948150000006,27.822304800000005,28.373661450000004,28.925018100000003,29.476374750000005,30.027731400000004,30.579088050000003,31.130444700000002,92.100000000000009,null,6,5.8,15.4,2.6551724137931036,15.931034482758623,7.9655172413793114,null,null,16.129411764705882,null,null,{"$f":"(U27*2.54)-DataBase!$M$5","v":233.51900000000003}]
[null,"#9",{"$f":"C27-($F$10/10)","v":91.45},36.003937007874015,87.95,null,null,null,null,25.091133950000003,25.631174912500001,26.171215875000001,26.711256837499999,27.2512978,27.791338762500001,28.331379724999998,28.871420687499999,29.41146165,29.951502612499997,30.491543574999998,91.15,null,5,4.8,12.8,2.666666666666667,13.333333333333336,6.6666666666666679,null,null,13.531034482758622,null,null,{"$f":"(U28*2.54)-DataBase!$M$5","v":231.10600000000002}]
[null,"PW",{"$f":"C28-($F$12/10)+Q1","v":90.820000000000007},35.755905511811029,{"$f":"C29-($G$9/10)-($F$8/10)","v":86.370000000000019},null,null,null,null,24.228810398000014,24.750291416500012,25.271772435000013,25.793253453500014,26.314734472000012,26.836215490500013,27.357696509000014,27.879177527500012,28.400658546000013,28.922139564500014,29.443620583000012,89.570000000000022,null,4,3.8,10.199999999999999,2.6842105263157894,10.736842105263158,5.3684210526315788,null,null,10.933333333333335,null,null,{"$f":"(U29*2.54)-DataBase!$M$5","v":227.09280000000007}]
[null,"GW",{"$f":"C29-($F$12/10)+R1","v":90.190000000000012},35.507874015748037,{"$f":"C30-($G$9/10)-($F$8/10)","v":85.740000000000023},null,null,null,null,23.889177272000016,24.403348306000012,24.917519340000013,25.431690374000013,25.945861408000013,26.460032442000013,26.974203476000014,27.488374510000014,28.002545544000014,28.516716578000015,29.030887612000011,88.940000000000026,null,3,2.8,7.6,2.7142857142857144,8.1428571428571423,4.0714285714285712,null,null,8.3368421052631572,null,null,{"$f":"(U30*2.54)-DataBase!$M$5","v":225.49260000000007}]
[null,"SW",{"$f":"C30-($F$12/10)+S1","v":89.560000000000016},35.259842519685044,{"$f":"C31-($G$9/10)-($F$8/10)","v":85.110000000000028},null,null,null,null,23.551941422000017,24.058854068500018,24.565766715000017,25.072679361500018,25.579592008000017,26.086504654500018,26.593417301000017,27.100329947500018,27.607242594000017,28.114155240500018,28.621067887000017,88.310000000000031,null,2,2.1,6.7,3.1904761904761902,6.3809523809523805,3.1904761904761902,null,null,5.742857142857142,null,null,{"$f":"(U31*2.54)-DataBase!$M$5","v":223.89240000000009}]
[null,"LW",{"$f":"C31-($F$12/10)+T1","v":88.930000000000021},35.011811023622052,{"$f":"C32-($G$9/10)-($F$8/10)","v":84.480000000000032},null,null,null,null,23.217102848000021,23.71680870400002,24.216514560000022,24.71622041600002,25.215926272000022,25.715632128000021,26.215337984000019,26.715043840000021,27.21474969600002,27.714455552000022,28.21416140800002,87.680000000000035,null,1,1.1000000000000001,3,2.7272727272727271,2.7272727272727271,1.3636363636363635,null,null,3.9809523809523806,null,null,{"$f":"(U32*2.54)-DataBase!$M$5","v":222.29220000000009}]
[null,null,{"$f":"(DataBase!E11/25.4)*F10","v":0.49370078740157486},2,{"$f":"(1.33/25.4)*F12","v":0.32988188976377952}]
[null,null,null,null,null,null,null,null,null,null,null,null,null,null,null,"WEDGE SWING WEIGHT TUNER"]
[null,"CLUB","METRIC P","PLAY LENGTH","NET.SHAFT","NET.SHAFT",null,null,null,"#3","#4","#5","#6","#7","#8","#9",{"$f":"IF(Q3=1000,\"PW\",Q4)","v":"PW"},{"$f":"IF(R3=1000,\"GW\",R4)","v":"GW"},{"$f":"IF(S3=1000,\"SW\",S4)","v":"SW"},{"$f":"IF(T3=1000,\"LW\",T4)","v":"LW"}]
[null,"#3",{"$f":"C22","v":97.15000000000002},{"$f":"C36/2.54","v":38.248031496063},{"$f":"F36/2.54","v":36.870078740157489},{"$f":"C36-($F$9/10)-($F$8/10)","v":93.65000000000002},"PLAY LENGTH DIFFERENCE MILLIMETER",null,null,{"$f":"(J13-J12)*25.4","v":-31.799999999999805},-28.599999999999813,-25.399999999999817,-22.199999999999825,-19.000000000000011,-15.800000000000017,-12.600000000000023,{"$f":"(Q13-Q12)*25.4","v":-12.549999999999853},{"$f":"(R13-R12)*25.4","v":-12.499999999999865},{"$f":"(S13-S12)*25.4","v":-12.449999999999875},{"$f":"(T13-T12)*25.4","v":-12.399999999999887}]
[null,"#4",{"$f":"C23","v":96.200000000000017},{"$f":"C37/2.54","v":37.874015748031503},{"$f":"F37/2.54","v":36.496062992125992},{"$f":"C37-($F$9/10)-($F$8/10)","v":92.700000000000017},"NEW SW AFTER LENGTH ADJUSTMENT",null,null,{"$f":"J57+2","v":-5.5118110236220019},-4.7559055118109796,-3.9999999999999574,-3.2440944881889351,-2.4881889763779554,-1.7322834645669332,-0.97637795275591088,{"$f":"(Q57+2)+Q4","v":-0.96456692913382369},{"$f":"R57+3+R4","v":4.7244094488220867E-2},{"$f":"S57+5+S4","v":2.0590551181102659},{"$f":"T57+5+T4","v":2.07086614173231}]
[null,"#5",95.250000000000014,37.500000000000007,36.122047244094496,91.750000000000014,{"$f":"IF(P4<>0,P4,\"SW TUNER\")","v":3},null,null,{"$f":"K38-C33","v":-1.2007874015748075},{"$f":"L38-C33","v":-0.7070866141732326},{"$f":"M38-C33","v":-0.21338582677165774},{"$f":"N38-C33","v":0.28031496062991712},{"$f":"O38-C33","v":0.77401574803149198},{"$f":"O57+P4+D33","v":1.2677165354330668},{"$f":"O38+C33","v":1.7614173228346417},{"$f":"O38+Q56+Q4","v":2.0912992125984213},{"$f":"O38+R56+R4","v":2.4211811023622007},{"$f":"O38+S56+S4","v":2.7510629921259802},{"$f":"O38+T56+T4","v":3.0809448818897596}]
[null,"#6",94.300000000000011,37.125984251968511,35.748031496062993,90.800000000000011,"SWP CORRECTION NEEDED",null,null,{"$f":"J38-J37-J55","v":4.3110236220471947},{"$f":"K38-K37-K55","v":4.048818897637747},3.7866141732282994,3.5244094488188522,3.2622047244094476,3,2.7377952755905524,3.055866141732245,2.3739370078739799,0.69200787401571429,1.0100787401574496]
[null,"#7",93.350000000000009,36.751968503937007,35.374015748031496,89.850000000000009,"GRAMS NEEDED",null,null,{"$f":"J39*J42","v":8.40649606299203},8.0571496062991166,7.6868267716534469,7.2955275590550235,6.8832519685039344,6.48,6.0505275590551202,{"$f":"(Q39*Q42)+(Q4*Q42)","v":6.9062574803148733},{"$f":"(R39*R42)+(R4*R42)","v":5.4837944881888934},1.6331385826770857,2.4342897637794536]
[null,"#8",92.4,36.377952755905511,35,88.9,1.5,"LEAD TAPE CENTIMETER",null,{"$f":"J40*($G$41*2.54)","v":32.028749999999633},30.697739999999634,29.286809999999633,27.795959999999639,26.225189999999991,24.688800000000001,23.052510000000009,26.312840999999668,20.893256999999686,6.2222579999996963,9.2746439999997179]
[null,"#9",91.45,36.003937007874015,34.625984251968504,87.95,"GRAMS/SWP AFT OFFSET F.PLAY L.",null,null,{"$f":"LOOKUP(J61,$D62:$D82,J62:J82)","v":1.95},1.99,2.0299999999999998,2.0699999999999998,2.11,2.16,2.21,2.2599999999999998,2.31,2.36,2.41]
[null,"PW",90.820000000000007,35.755905511811029,34.003937007874022,{"$f":"C43-($G$9/10)-($F$8/10)","v":86.370000000000019},"EXPECTED STANDARD HEAD WEIGHT 7 GRAM SLOPE  - ACTUAL HEAD WEIGHT (INPUT) - TARGET HEAD WEIGHT (CALC) - GRAMS NEEDED THIS BUILD (CALK)"]
[null,"GW",90.190000000000012,35.507874015748037,33.755905511811029,{"$f":"C44-($G$9/10)-($F$8/10)","v":85.740000000000023},"EXPECTED STD HEAD WGT GRAMS",null,null,{"$f":"J45","v":240},{"$f":"J45+7","v":247},{"$f":"K44+7","v":254},261,268,275,282,289,296,303,310]
[null,"SW",89.560000000000016,35.259842519685044,33.507874015748044,{"$f":"C45-($G$9/10)-($F$8/10)","v":85.110000000000028},"ACTUAL HEAD WEIGHT THIS SET",null,null,240,248,252,260,264,273,281,286,291,290,307]
[null,"LW",88.930000000000021,35.011811023622052,33.259842519685051,{"$f":"C46-($G$9/10)-($F$8/10)","v":84.480000000000032},"TARGET HEAD WEIGHT",null,null,{"$f":"J44+J40","v":248.40649606299203},255.05714960629911,261.68682677165344,268.29552755905502,274.88325196850394,281.48,288.05052755905513,295.90625748031488,301.48379448818889,304.63313858267708,312.43428976377947]
[null,"STAND-ALONE SW CALK.",null,null,null,null,"GRAMS TO ADD THIS BUILD",null,null,{"$f":"J46-J45","v":8.4064960629920336},{"$f":"K46-K45","v":7.0571496062991059},9.6868267716534433,8.2955275590550173,10.883251968503941,8.4800000000000182,7.0505275590551264,9.9062574803148777,10.483794488188892,14.633138582677077,5.4342897637794749]
[null,"TOTAL WEIGHT GRAMS",null,338.2,null,null,"TOTAL WEIGHT GRAMS",null,null,421,428,433,439,445,451,457,466,472,478,480]
[null,"BALANCE POINT CM",null,82.23,null,null,"BALANCE POINT CM",null,null,73,{"$f":"J49-0.5","v":72.5},{"$f":"K49-0.5","v":72},71.5,71,70.5,70,69.5,69,69,69]
[null,"SWING WEIGHT VALUE",null,{"$f":"SWC!C14","v":"D3.2"},null,null,"SWING WEIGHT VALUE",null,null,{"$f":"SWC!C3","v":"D3.1"},{"$f":"SWC!C4","v":"D3.4"},{"$f":"SWC!C5","v":"D3.2"},{"$f":"SWC!C6","v":"D3.2"},{"$f":"SWC!C7","v":"D3.1"},{"$f":"SWC!C8","v":"D3.0"},{"$f":"SWC!C9","v":"D2.9"},{"$f":"SWC!C10","v":"D3.5"},{"$f":"SWC!C11","v":"D3.2"},{"$f":"SWC!C12","v":"D4.8"},{"$f":"SWC!C13","v":"D5.3"}]
[null,null,null,null,null,null,null,null,null,"#3","#4","#5","#6","#7","#8","#9","PW","GW","SW","LW"]
[null,null,null,null,null,null,null,null,null,{"$f":"J39","v":4.3110236220471947},{"$f":"K39","v":4.048818897637747},3.7866141732282994,3.5244094488188522,3.2622047244094476,3,2.7377952755905524,3.055866141732245,2.3739370078739799,0.69200787401571429,1.0100787401574496]
[null,null,null,null,null,null,null,null," "," "," "," "]
[null,null,null,null,null,null,null,null," "]
[null,null,null,null,null,null,"SW EQUALIZER",null," ",{"$f":"$D$33-2","v":0},{"$f":"$D$33-2","v":0},0,0,0,0,0,0,0,0,0]
[null,null,null,null,null,null,"RELATIVE PROGR.SWP SLOPE-MOI",null,null,{"$f":"K56-E19","v":-2.4872047244094491},{"$f":"L56-E19","v":-1.9897637795275591},{"$f":"M56-E19","v":-1.4923228346456694},{"$f":"N56-E19","v":-0.99488188976377956},{"$f":"-E19","v":-0.49744094488188978},0,{"$f":"IF($H$4=TRUE,C33,C33)","v":0.49370078740157486},{"$f":"IF($H$4=TRUE,P56+$E$33,P56+$C$33)","v":0.82358267716535438},{"$f":"IF($H$4=TRUE,Q56+$E$33,Q56+$C$33)","v":1.1534645669291339},{"$f":"IF($H$4=TRUE,R56+$E$33,R56+$C$33)","v":1.4833464566929133},{"$f":"IF($H$4=TRUE,S56+$E$33,S56+$C$33)","v":1.8132283464566927}]
[null,null,null,null,null,null,"SW POINTS - LENGTH CHANGE",null,null,{"$f":"6*(J36/25.4)","v":-7.5118110236220019},-6.7559055118109796,-5.9999999999999574,-5.2440944881889351,-4.4881889763779554,-3.7322834645669332,-2.9763779527559109,-2.9645669291338237,-2.9527559055117791,-2.9409448818897341,-2.92913385826769]
[]
[null,null,null,null,null,null,"PLAY LENGTH CHANGE",null,{"$f":"I36","v":0},-31.799999999999805,-28.599999999999813,-25.399999999999817,-22.199999999999825,-19.000000000000011,-15.800000000000017,-12.600000000000023,-12.549999999999853,-12.499999999999865,-12.449999999999875,-12.399999999999887]
[null,null,"offsett","choise",null,"change","OFFSET vs STANDARD",null,{"$f":"$C$61","v":4},{"$f":"$C$61","v":4},4,4,4,4,4,4,4,4,4,4]
[null,null,{"$f":"LOOKUP(D61,D62:D82,C62:C82)","v":4},9,5,{"$f":"LOOKUP(D61,D62:D82,E62:E82)","v":0.5},"CHOICE",null,{"$f":"$D$61","v":9},{"$f":"$D$61","v":9},9,9,9,9,9,9,9,9,9,9]
[null,null,12,1,{"$f":"F62","v":1.5},1.5,"GRAMS SWP AT STD",null,1.84,1.87,1.91,{"$f":"I74","v":1.95},{"$f":"J74","v":1.99},2.0299999999999998,2.0699999999999998,2.11,2.16,2.21,2.2599999999999998,2.31]
[null,null,11,{"$f":"D62+1","v":2},{"$f":"F63","v":1.375},{"$f":"F62-1/8","v":1.375},"GRAMS SWP AT STD",null,{"$f":"(I66-I62)/3+I62","v":1.85},{"$f":"(J66-J62)/3+J62","v":1.8833333333333333},1.9233333333333333,1.9633333333333334,2.0033333333333334,2.043333333333333,2.083333333333333,2.1266666666666665,2.1766666666666667,2.2266666666666666,2.2766666666666664,2.3266666666666667]
[null,null,10,{"$f":"D63+1","v":3},1.25,1.25,"GRAMS SWP AT STD",null,{"$f":"(I66-I62)/3+I63","v":1.86},{"$f":"(J66-J62)/3+J63","v":1.8966666666666665},1.9366666666666668,1.9766666666666668,2.0166666666666666,2.0566666666666662,2.0966666666666662,2.1433333333333331,2.1933333333333334,2.2433333333333332,2.293333333333333,2.3433333333333333]
[null,null,9,4,1.125,1.125,"GRAMS SWP AT STD",null,{"$f":"(I66-I62)/3+I64","v":1.87},{"$f":"(J66-J62)/3+J64","v":1.9099999999999997},1.9500000000000002,1.9900000000000002,2.0299999999999998,2.0699999999999994,2.1099999999999994,2.1599999999999997,2.21,2.2599999999999998,2.3099999999999996,2.36]
[null,null,8,5,1,1,"GRAMS SWP AT STD",null,{"$f":"J62","v":1.87},{"$f":"K62","v":1.91},1.95,1.99,2.0299999999999998,2.0699999999999998,2.11,2.16,2.21,2.2599999999999998,2.31,{"$f":"S70","v":2.36}]
[null,null,7,6,0.875,0.875,"GRAMS SWP AT STD",null,{"$f":"(I70-I66)/3+I66","v":1.8833333333333333},1.9233333333333333,1.9633333333333334,2.0033333333333334,2.043333333333333,2.083333333333333,2.1266666666666665,2.1766666666666667,2.2266666666666666,2.2766666666666664,2.3266666666666667,2.3766666666666665]
[null,null,6,7,0.75,0.75,"GRAMS SWP AT STD",null,{"$f":"(I70-I66)/3+I67","v":1.8966666666666665},1.9366666666666668,1.9766666666666668,2.0166666666666666,2.0566666666666662,2.0966666666666662,2.1433333333333331,2.1933333333333334,2.2433333333333332,2.293333333333333,2.3433333333333333,2.3933333333333331]
[null,null,5,8,0.625,0.625,"GRAMS SWP AT STD",null,{"$f":"(I70-I66)/3+I68","v":1.9099999999999997},1.9500000000000002,1.9900000000000002,2.0299999999999998,2.0699999999999994,2.1099999999999994,2.1599999999999997,2.21,2.2599999999999998,2.3099999999999996,2.36,2.4099999999999997]
[null,null,4,9,0.5,0.5,"GRAMS SWP AT STD",null,{"$f":"J66","v":1.91},{"$f":"K66","v":1.95},1.99,2.0299999999999998,2.0699999999999998,2.11,2.16,2.21,2.2599999999999998,2.31,{"$f":"R74","v":2.36},{"$f":"S74","v":2.41}]
[null,null,3,10,0.375,0.375,"GRAMS SWP AT STD",null,{"$f":"(I74-I70)/3+I70","v":1.9233333333333333},1.9633333333333334,2.0033333333333334,2.043333333333333,2.083333333333333,2.1266666666666665,2.1766666666666667,2.2266666666666666,2.2766666666666664,2.3266666666666667,2.3766666666666665,2.4266666666666667]
[null,null,2,11,0.25,0.25,"GRAMS SWP AT STD",null,{"$f":"(I74-I70)/3+I71","v":1.9366666666666668},1.9766666666666668,2.0166666666666666,2.0566666666666662,2.0966666666666662,2.1433333333333331,2.1933333333333334,2.2433333333333332,2.293333333333333,2.3433333333333333,2.3933333333333331,2.4433333333333334]
[null,null,1,12,0.125,0.125,"GRAMS SWP AT STD",null,{"$f":"(I74-I70)/3+I72","v":1.9500000000000002},1.9900000000000002,2.0299999999999998,2.0699999999999994,2.1099999999999994,2.1599999999999997,2.21,2.2599999999999998,2.3099999999999996,2.36,2.4099999999999997,2.46]
[null,null,0,13,0,0,"GRAMS SWP AT STD",null,1.95,1.99,2.0299999999999998,2.0699999999999998,2.11,2.16,2.21,2.2599999999999998,2.31,2.36,2.41,2.46]
[null,null,-1,14,-0.125,-0.125,"GRAMS SWP AT STD",null,{"$f":"(I78-I74)/3+I74","v":1.9233333333333333},1.9633333333333334,2.003333333333333,2.043333333333333,2.083333333333333,2.13,2.1766666666666667,2.2266666666666666,2.2766666666666668,2.3266666666666667,2.3766666666666669,2.4266666666666667]
[null,null,-2,15,-0.25,-0.25,"GRAMS SWP AT STD",null,{"$f":"(I78-I74)/3+I75","v":1.8966666666666667},1.9366666666666668,1.9766666666666663,2.0166666666666666,2.0566666666666662,2.0999999999999996,2.1433333333333335,2.1933333333333334,2.2433333333333336,2.2933333333333334,2.3433333333333337,2.3933333333333335]
[null,null,-3,16,-0.375,-0.375,"GRAMS SWP AT STD",null,{"$f":"(I78-I74)/3+I76","v":1.87},1.9100000000000001,1.9499999999999997,1.99,2.0299999999999994,2.0699999999999994,2.1100000000000003,2.16,2.2100000000000004,2.2600000000000002,2.3100000000000005,2.3600000000000003]
[null,null,-4,17,-0.5,-0.5,"GRAMS SWP AT STD",null,{"$f":"J62","v":1.87},{"$f":"K62","v":1.91},1.95,1.99,2.0299999999999998,2.0699999999999998,2.11,2.16,2.21,2.2599999999999998,2.31,{"$f":"R74","v":2.36}]
[null,null,-5,18,-0.625,-0.625,"GRAMS SWP AT STD",null,{"$f":"(I82-I78)/3+I78","v":1.9233333333333333},1.9633333333333332,2.0033333333333334,2.0466666666666669,2.09,2.1333333333333333,2.1766666666666667,2.2266666666666666,2.2766666666666668,2.3266666666666667,2.3766666666666665,2.4266666666666667]
[null,null,-6,19,-0.75,{"$f":"F79-1/8","v":-0.75},"GRAMS SWP AT STD",null,{"$f":"(I82-I78)/3+I79","v":1.9766666666666666},2.0166666666666666,2.0566666666666666,2.1033333333333335,2.15,2.1966666666666668,2.2433333333333336,2.293333333333333,2.3433333333333337,2.3933333333333335,2.4433333333333329,2.4933333333333336]
[null,null,-7,20,-0.875,{"$f":"F80-1/8","v":-0.875},"GRAMS SWP AT STD",null,{"$f":"(I82-I78)/3+I80","v":2.0299999999999998},2.0699999999999998,2.11,2.16,2.21,2.2600000000000002,2.3100000000000005,2.3599999999999994,2.4100000000000006,2.4600000000000004,2.5099999999999993,2.5600000000000005]
[null,null,-8,21,-1,{"$f":"F81-1/8","v":-1},"GRAMS SWP AT STD",null,{"$f":"M78","v":2.0299999999999998},{"$f":"N78","v":2.0699999999999998},2.11,2.16,2.21,2.2599999999999998,2.31,2.36,{"$f":"S74","v":2.41},{"$f":"T74","v":2.46},2.5099999999999998,2.56]
[]
[]
[]
[null,"IMPERIAL",null,null,null,"METRIC"]
[null,{"$f":"F87/25.4","v":0.12598425196850396},"GRIP CAP THICKNESS",null,null,{"$f":"F8","v":3.2}]
[null,{"$f":"F88/25.4","v":1.2519685039370079},{"$f":"G88/25.4","v":1.6259842519685039},"BBGM - IRON - WEDGE",null,{"$f":"F9","v":31.8},{"$f":"G9","v":41.3},null,"NAME",{"$f":"J6","v":0},null,null,"HEADS",{"$f":"N6","v":0},null,"SHAFTS",{"$f":"Q6","v":0},null,"SET UP",{"$f":"T6","v":"00:00:00"}]
[null,{"$f":"F89/25.4","v":0.37401574803149606},"LENGTH BETWEEN IRONS",null,null,{"$f":"F10","v":9.5}]
[null,null,null,null,null,null,null,null,"#2",{"$f":"J11","v":"#3"},{"$f":"K11","v":"#4"},"#5","#6","#7","#8","#9","PW","GW","SW","LW"]
[null,{"$f":"F91/25.4","v":0.24803149606299213},"LENGTH BETWEEN WEDGES",null,null,{"$f":"F12","v":6.3},null,null,{"$f":"PRINT!I89","v":0},{"$f":"39+F122","v":39},{"$f":"J91-0.5","v":38.5},{"$f":"K91-0.5","v":38},{"$f":"L91-0.5","v":37.5},{"$f":"M91-0.5","v":37},{"$f":"N91-0.5","v":36.5},{"$f":"O91-0.5","v":36},{"$f":"P91-0.25","v":35.75},{"$f":"Q91-0.25","v":35.5},{"$f":"R91-0.25","v":35.25},{"$f":"S91-0.25","v":35}]
[null,"IMPERIAL","#8 IRON PLAY LENGTH",null,null,"METRIC",null,null,"THIS SET",{"$f":"J13","v":38.248031496063},{"$f":"K13","v":37.874015748031503},37.500000000000007,37.125984251968511,36.751968503937007,36.377952755905511,36.003937007874015,35.755905511811029,35.507874015748037,35.259842519685044,35.011811023622052]
[null,{"$f":"F93/2.54","v":36.377952755905511},"#8 IRON PLAY LENGTH",null,null,{"$f":"F14","v":92.4},null,null,"DIFF",{"$f":"J14","v":-1.2519685039370003},{"$f":"K14","v":-1.1259842519684966},-0.99999999999999289,-0.87401574803148918,-0.74803149606299257,-0.62204724409448886,-0.49606299212598515,-0.49409448818897062,-0.49212598425196319,-0.49015748031495576,-0.48818897637794834]
[null,"SW SLOPE IRONS",null,"STD.SW","SW SLOPE WEDGE",null,null,null,null,null,null,null,null,"MANUEL PLAY LENGTH ADJ MILLIMETER",null,null,{"$f":"Q1","v":"0"},{"$f":"R1","v":"0"},"0","0"]
[null,"PR.INCH",{"$f":"C33","v":0.49370078740157486},{"$f":"D33","v":2},{"$f":"E33","v":0.32988188976377952},"PR.INC",null,null,null,null,null,null,null,"MANUEL OVER RIDE SW VALUE",null,null,{"$f":"Q4","v":"0"},{"$f":"R4","v":"0"},"0","0"]
[null,"CLUB","METRIC P","PLAY LENGTH","NET.SHAFT","NET.SHAFT",null,null,null,"#3","#4","#5","#6","#7","#8","#9","PW","GW","SW","LW"]
[null,"#3",{"$f":"C36","v":97.15000000000002},{"$f":"D36","v":38.248031496063},36.870078740157489,93.65000000000002,"PLAY LENGTH DIFFERENCE MILLIMETER",null,null,{"$f":"J36","v":-31.799999999999805},{"$f":"K36","v":-28.599999999999813},-25.399999999999817,-22.199999999999825,-19.000000000000011,-15.800000000000017,-12.600000000000023,-12.549999999999853,-12.499999999999865,-12.449999999999875,-12.399999999999887]
[null,"#4",{"$f":"C37","v":96.200000000000017},37.874015748031503,36.496062992125992,92.700000000000017,"PLAY LENGTH DIFFERENCE IMPERIAL",null,null,{"$f":"J97/25.4","v":-1.2519685039370003},{"$f":"K97/25.4","v":-1.1259842519684966},-0.99999999999999289,-0.87401574803148918,-0.74803149606299257,-0.62204724409448886,-0.49606299212598515,-0.49409448818897062,-0.49212598425196319,-0.49015748031495571,-0.48818897637794834]
[null,"#5",{"$f":"C38","v":95.250000000000014},37.500000000000007,36.122047244094496,91.750000000000014,"SW TARGET VALUES",null,null,{"$f":"J38","v":-1.2007874015748075},-0.7070866141732326,-0.21338582677165774,0.28031496062991712,0.77401574803149198,1.2677165354330668,1.7614173228346417,2.0912992125984213,2.4211811023622007,2.7510629921259802,3.0809448818897596]
[null,"#6",{"$f":"C39","v":94.300000000000011},37.125984251968511,35.748031496062993,90.800000000000011,"SWP CORRECTION NEEDED",null,null,{"$f":"J39","v":4.3110236220471947},4.048818897637747,3.7866141732282994,3.5244094488188522,3.2622047244094476,3,2.7377952755905524,3.055866141732245,2.3739370078739799,0.69200787401571429,1.0100787401574496]
[null,"#7",{"$f":"C40","v":93.350000000000009},36.751968503937007,35.374015748031496,89.850000000000009,{"$f":"#REF!","v":{"$error":"#REF!"}},"GRAMS NEEDED",null,{"$f":"J40","v":8.40649606299203},8.0571496062991166,7.6868267716534469,7.2955275590550235,6.8832519685039344,6.48,6.0505275590551202,6.9062574803148733,5.4837944881888934,1.6331385826770857,2.4342897637794536]
[null,"#8",{"$f":"C41","v":92.4},36.377952755905511,35,88.9,{"$f":"G41","v":1.5},"LEAD TAPE CENTIMETER",null,{"$f":"J41","v":32.028749999999633},30.697739999999634,29.286809999999633,27.795959999999639,26.225189999999991,24.688800000000001,23.052510000000009,26.312840999999668,20.893256999999686,6.2222579999996963,9.2746439999997179]
[null,"#9",{"$f":"C42","v":91.45},36.003937007874015,34.625984251968504,87.95,"GRAMS/SWP AFT OFFSET F.PLAY L.",null,null,{"$f":"J42","v":1.95},1.99,2.0299999999999998,2.0699999999999998,2.11,2.16,2.21,2.2599999999999998,2.31,2.36,2.41]
[null,"PW",{"$f":"C43","v":90.820000000000007},35.755905511811029,34.003937007874022,86.370000000000019,"STANDARD HEAD WEIGHT 7 GRAM SLOPE (1) - ACTUAL HEAD WEIGHT (2) - TARGET HEAD WEIGHT (3) - GRAMS NEEDED THIS BUILD (4)"]
[null,"GW",{"$f":"C44","v":90.190000000000012},35.507874015748037,33.755905511811029,85.740000000000023,"EXPECTED STD HEAD WGT GRAMS",null,null,{"$f":"J44","v":240},{"$f":"K44","v":247},254,261,268,275,282,289,296,303,310]
[null,"SW",{"$f":"C45","v":89.560000000000016},35.259842519685044,33.507874015748044,85.110000000000028,"ACTUAL HEAD WEIGHT THIS SET",null,null,{"$f":"J45","v":240},248,252,260,264,273,281,286,291,290,307]
[null,"LW",{"$f":"C46","v":88.930000000000021},35.011811023622052,33.259842519685051,84.480000000000032,"TARGET HEAD WEIGHT",null,null,{"$f":"J46","v":248.40649606299203},255.05714960629911,261.68682677165344,268.29552755905502,274.88325196850394,281.48,288.05052755905513,295.90625748031488,301.48379448818889,304.63313858267708,312.43428976377947]
[null,null,null,null,null,null,"GRAMS TO ADD THIS BUILD",null,null,{"$f":"J47","v":8.4064960629920336},7.0571496062991059,9.6868267716534433,8.2955275590550173,10.883251968503941,8.4800000000000182,7.0505275590551264,9.9062574803148777,10.483794488188892,14.633138582677077,5.4342897637794749]
[null," ",null,null,null,null,"TOTAL WEIGHT GRAMS",null,null,{"$f":"J48","v":421},428,433,439,445,451,457,466,472,478,480]
[null," ",null,null,null,null,"BALANCE POINT CM",null,null,{"$f":"J49","v":73},72.5,72,71.5,71,70.5,70,69.5,69,69,69]
[null," ",null,null,null,null,"SWING WEIGHT VALUE",null,null,{"$f":"J50","v":"D3.1"},"D3.4","D3.2","D3.2","D3.1","D3.0","D2.9","D3.5","D3.2","D4.8","D5.3"]
[null,null,null,null,null,null,null,null,null,"#3","#4","#5","#6","#7","#8","#9","PW","GW","SW","LW"]

{"sheet":"PRINT","index":4,"n_rows":70,"n_cols":43,"rows_kept":70,"cut":false,"hidden":true,"merged":[[9,2,9,4],[1,2,1,6],[2,9,2,11],[2,13,2,14],[2,16,2,17],[3,2,3,6],[4,2,4,4],[4,5,4,6],[5,2,6,4],[5,5,6,6],[7,2,7,4],[7,5,7,6],[8,2,8,6],[10,2,10,4],[10,5,10,6],[11,2,11,4],[11,5,11,6],[12,2,12,4],[12,5,12,6],[12,11,12,13],[12,14,12,16],[15,1,16,3],[15,4,16,4],[15,5,16,5],[15,6,16,8],[49,6,49,7],[41,1,41,5],[42,1,42,6],[43,1,43,6],[44,1,44,6],[46,6,46,7],[47,6,47,7],[48,6,48,7],[60,6,60,7],[61,6,61,7],[50,6,50,7],[51,6,51,7],[52,6,52,7],[53,6,53,7],[54,6,54,7],[55,6,55,7],[56,6,56,7],[57,6,57,7],[58,6,58,7],[59,6,59,7],[68,6,68,7],[69,6,69,7],[62,6,62,7],[63,6,63,7],[64,6,64,7],[65,6,65,7],[66,6,66,7],[67,6,67,7]]}
[null,null,null,null,null,null,5,null,1]
[]
[null,null,"1/8\"","1/16\"","1/32\"","1,00\"",null,null,"NAME","HOWARD JONES",null,null,"HEADS","CALLAWAY DIABLO F.",null,"SHAFTS","SS FCM GRAPHITE",null,"SET UP","6-PW",null,null,null,null,null,null,null,null,null,null,null,null,null,null,null,null,0.5,25.4]
[]
[null,null,"GRIP CAP THICK",null,null,{"$f":"'MOI DRY FIT METRIC'!F8:G8","v":3.2},null,null,"PLAY L.","#3","#4","#5","#6","#7","#8","#9","PW","GW","SW","LW",null,null,null,null,null,null,null,null,null,null,null,null,null,null,null,null,null,null,null,null,null,null,25]
[null,null,"MILLIMETER BETW.CLUBS",null,null,{"$f":"'MOI DRY FIT METRIC'!F11:G11","v":0},null,null,{"$f":"'MOI DRY FIT METRIC'!F61","v":0.5},{"$f":"'MOI DRY FIT METRIC'!J12","v":39.5},{"$f":"'MOI DRY FIT METRIC'!K12","v":39},{"$f":"'MOI DRY FIT METRIC'!L12","v":38.5},{"$f":"'MOI DRY FIT METRIC'!M12","v":38},{"$f":"'MOI DRY FIT METRIC'!N12","v":37.5},{"$f":"'MOI DRY FIT METRIC'!O12","v":37},{"$f":"'MOI DRY FIT METRIC'!P12","v":36.5},{"$f":"'MOI DRY FIT METRIC'!Q12","v":36.25},{"$f":"'MOI DRY FIT METRIC'!R12","v":36},{"$f":"'MOI DRY FIT METRIC'!S12","v":35.75},{"$f":"'MOI DRY FIT METRIC'!T12","v":35.5}]
[null,null,null,null,null,null,null,null,"SUGGEST",{"$f":"'MOI DRY FIT METRIC'!J13","v":38.248031496063},{"$f":"'MOI DRY FIT METRIC'!K13","v":37.874015748031503},{"$f":"'MOI DRY FIT METRIC'!L13","v":37.500000000000007},{"$f":"'MOI DRY FIT METRIC'!M13","v":37.125984251968511},{"$f":"'MOI DRY FIT METRIC'!N13","v":36.751968503937007},{"$f":"'MOI DRY FIT METRIC'!O13","v":36.377952755905511},{"$f":"'MOI DRY FIT METRIC'!P13","v":36.003937007874015},{"$f":"'MOI DRY FIT METRIC'!Q13","v":35.755905511811029},{"$f":"'MOI DRY FIT METRIC'!R13","v":35.507874015748037},{"$f":"'MOI DRY FIT METRIC'!S13","v":35.259842519685044},{"$f":"'MOI DRY FIT METRIC'!T13","v":35.011811023622052}]
[null,null,"LENGTH BETW WEDGES",null,null,{"$f":"'MOI DRY FIT METRIC'!F12:G12","v":6.3},null,null,"DIFF",{"$f":"'MOI DRY FIT METRIC'!J14","v":-1.2519685039370003},{"$f":"'MOI DRY FIT METRIC'!K14","v":-1.1259842519684966},{"$f":"'MOI DRY FIT METRIC'!L14","v":-0.99999999999999289},{"$f":"'MOI DRY FIT METRIC'!M14","v":-0.87401574803148918},{"$f":"'MOI DRY FIT METRIC'!N14","v":-0.74803149606299257},{"$f":"'MOI DRY FIT METRIC'!O14","v":-0.62204724409448886},{"$f":"'MOI DRY FIT METRIC'!P14","v":-0.49606299212598515},{"$f":"'MOI DRY FIT METRIC'!Q14","v":-0.49409448818897062},{"$f":"'MOI DRY FIT METRIC'!R14","v":-0.49212598425196319},{"$f":"'MOI DRY FIT METRIC'!S14","v":-0.49015748031495576},{"$f":"'MOI DRY FIT METRIC'!T14","v":-0.48818897637794834}]
[null,null,null,null,null,null,null,null,null,{"$f":"J8*25.4","v":-31.799999999999805},-28.599999999999813,-25.399999999999817,-22.199999999999825,-19.000000000000011,-15.800000000000017,-12.600000000000023,-12.549999999999853,-12.499999999999865,-12.449999999999875,-12.399999999999887]
[null,null,"BBGM",null,null,{"$f":"'MOI DRY FIT METRIC'!F9","v":31.8},{"$f":"'MOI DRY FIT METRIC'!G9","v":41.3}]
[null,null,"#3 IRON PLAY LENGTH",null,null,{"$f":"'MOI DRY FIT METRIC'!F14:G14","v":92.4}]
[null,null,"MOI-P TO ADD-GREEN CLUB",null,null,9]
[null,null,". =NEEDED WEIGTH IN GRAMS",null,null,{"$f":"F12/R13","v":0.37948176817668233},null,null,"Grams",1,0.1,"LIGHTEST TIP W.-TIP W PROG.",null,null,"MOI points pr gram at this lenght",null,null,{"$f":"((AH19*AH19)*1)/1000","v":23.716554403240011},"Gr.MOI-P",{"$f":"R13/100","v":0.23716554403240012}]
[]
[]
[null,"SW PROGRESSION BETW.CLUBS",null,null,{"$f":"(1.33/25.4)*F6","v":0},{"$f":"(1.33/25.4)*F8","v":0.32988188976377952},"SW PROG. WEDGES",null,null,"Grams","Grams","Grams","Grams","Grams","Grams","Grams","Grams","Grams","Grams","Grams"]
[null,null,null,null,null,null,null,null,null,{"$f":"J13","v":1},{"$f":"J17+K13","v":1.1000000000000001},{"$f":"K17+K13","v":1.2000000000000002},{"$f":"L17+K13","v":1.3000000000000003},{"$f":"M17+K13","v":1.4000000000000004},{"$f":"N17+K13","v":1.5000000000000004},{"$f":"O17+K13","v":1.6000000000000005},{"$f":"P17+K13","v":1.7000000000000006},{"$f":"Q17+K13","v":1.8000000000000007},{"$f":"R17+K13","v":1.9000000000000008},{"$f":"S17+K13","v":2.0000000000000009}]
[null,"CLUB SW+","METRIC","Play lenght","Net shaft",null,null,null,null,"MOI Points","MOI Points","MOI Points","MOI Points","MOI Points","MOI Points","MOI Points","MOI Points","MOI Points","MOI Points","MOI Points","Butt to tip",null,null,null,null,null,null,null,null,null,null,null,null,"Butt-tip Cm"]
[null,"IN WORK",{"$f":"F11*2.54","v":234.69600000000003},{"$f":"C19/2.54","v":92.4},{"$f":"D19-($F$5/25.4)-$F$10","v":60.474015748031505},null,null,null,null,{"$f":"($AH19*$AH19*(J$17/1000))","v":23.716554403240011},26.088209843564012,28.459865283888014,30.831520724212023,33.203176164536025,35.574831604860023,37.946487045184028,40.318142485508034,42.689797925832039,45.061453366156037,47.433108806480043,{"$f":"E19+($F$5/25.4)*2.54","v":60.794015748031505},null,null,"gram","mm","pr mm","Just MM","BT Just",null,null,"Matt",null,null,{"$f":"(U19*2.54)-DataBase!$M$5","v":154.00180000000003}]
[null,{"$f":"E16","v":0},{"$f":"C19-($F$6/10)","v":234.69600000000003},{"$f":"C20/2.54","v":92.4},60.474015748031505,null,null,null,null,23.565013081000011,25.921514389100015,28.278015697200019,30.634517005300026,32.991018313400026,35.347519621500027,37.704020929600034,40.060522237700035,42.417023545800042,44.773524853900042,47.130026162000043,{"$f":"E20+($F$5/25.4)","v":60.600000000000009},null,10,9.8000000000000007,25.8,{"$f":"Y20/X20","v":2.6326530612244898},{"$f":"(Y20/X20)*W20","v":26.326530612244898},{"$f":"AA20/2","v":13.163265306122449},null,null,{"$f":"AA20","v":26.326530612244898},null,null,{"$f":"(U20*2.54)-DataBase!$M$5","v":153.50900000000004}]
[null,{"$f":"B20+B20","v":0},234.69600000000003,{"$f":"C21/2.54","v":92.4},60.474015748031505,null,null,null,null,23.565013081000011,25.921514389100015,28.278015697200019,30.634517005300026,32.991018313400026,35.347519621500027,37.704020929600034,40.060522237700035,42.417023545800042,44.773524853900042,47.130026162000043,60.600000000000009,null,9,8.8000000000000007,23.1,{"$f":"Y21/X21","v":2.625},{"$f":"(Y21/X21)*W21","v":23.625},{"$f":"AA21/2","v":11.8125},null,null,{"$f":"AA20-2.4","v":23.9265306122449},null,null,{"$f":"(U21*2.54)-DataBase!$M$5","v":153.50900000000004}]
[null,{"$f":"B21+B20","v":0},234.69600000000003,92.4,60.474015748031505,null,null,null,null,23.565013081000011,25.921514389100015,28.278015697200019,30.634517005300026,32.991018313400026,35.347519621500027,37.704020929600034,40.060522237700035,42.417023545800042,44.773524853900042,47.130026162000043,60.600000000000009,null,8,7.8,20.6,2.6410256410256414,21.128205128205131,10.564102564102566,null," ",{"$f":"AA21-2.4","v":21.225000000000001}," "," ",{"$f":"(U22*2.54)-DataBase!$M$5","v":153.50900000000004}]
[null,{"$f":"B22+B20","v":0},234.69600000000003,92.4,60.474015748031505,null,null,null,null,23.565013081000011,25.921514389100015,28.278015697200019,30.634517005300026,32.991018313400026,35.347519621500027,37.704020929600034,40.060522237700035,42.417023545800042,44.773524853900042,47.130026162000043,60.600000000000009,null,7,6.8,18,2.6470588235294117,18.52941176470588,9.2647058823529402,null,null,18.728205128205133,null,null,{"$f":"(U23*2.54)-DataBase!$M$5","v":153.50900000000004}]
[null,{"$f":"B23+B20","v":0},234.69600000000003,92.4,60.474015748031505,null,null,null,null,23.565013081000011,25.921514389100015,28.278015697200019,30.634517005300026,32.991018313400026,35.347519621500027,37.704020929600034,40.060522237700035,42.417023545800042,44.773524853900042,47.130026162000043,60.600000000000009,null,6,5.8,15.4,2.6551724137931036,15.931034482758623,7.9655172413793114,null,null,16.129411764705882,null,null,{"$f":"(U24*2.54)-DataBase!$M$5","v":153.50900000000004}]
[null,{"$f":"B24+B20","v":0},234.69600000000003,92.4,60.474015748031505,null,null,null,null,23.565013081000011,25.921514389100015,28.278015697200019,30.634517005300026,32.991018313400026,35.347519621500027,37.704020929600034,40.060522237700035,42.417023545800042,44.773524853900042,47.130026162000043,60.600000000000009,null,5,4.8,12.8,2.666666666666667,13.333333333333336,6.6666666666666679,null,null,13.531034482758622,null,null,{"$f":"(U25*2.54)-DataBase!$M$5","v":153.50900000000004}]
[null,{"$f":"\"#\"&\"PW\"","v":"#PW"},{"$f":"C25-($F$8/10)","v":234.06600000000003},92.151968503937013,60.225984251968512,null,null,null,null,23.371988641000009,25.709187505100008,28.046386369200011,30.383585233300018,32.720784097400021,35.057982961500024,37.395181825600027,39.732380689700022,42.069579553800033,44.406778417900036,46.743977282000039,60.351968503937016,null,4,3.8,10.199999999999999,2.6842105263157894,10.736842105263158,5.3684210526315788,null,null,10.933333333333335,null,null,{"$f":"(U26*2.54)-DataBase!$M$5","v":152.87900000000002}]
[null,"#GW",{"$f":"C26-($F$8/10)","v":233.43600000000004},91.903937007874035,59.977952755905534,null,null,null,null,23.179758001000017,25.497733801100019,27.815709601200023,30.133685401300031,32.451661201400036,34.769637001500037,37.087612801600038,39.405588601700039,41.723564401800047,44.041540201900048,46.359516002000056,60.103937007874038,null,3,2.8,7.6,2.7142857142857144,8.1428571428571423,4.0714285714285712,null,null,8.3368421052631572,null,null,{"$f":"(U27*2.54)-DataBase!$M$5","v":152.24900000000005}]
[null,"#SW",{"$f":"C27-($F$8/10)","v":232.80600000000004},91.655905511811042,59.729921259842541,null,null,null,null,22.98832116100002,25.287153277100021,27.585985393200023,29.884817509300031,32.183649625400037,34.482481741500038,36.78131385760004,39.080145973700041,41.37897808980005,43.677810205900052,45.97664232200006,59.855905511811045,null,2,2.1,6.7,3.1904761904761902,6.3809523809523805,3.1904761904761902,null,null,5.742857142857142,null,null,{"$f":"(U28*2.54)-DataBase!$M$5","v":151.61900000000006}]
[null,"#LW",{"$f":"C28-($F$8/10)","v":232.17600000000004},91.40787401574805,59.481889763779549,null,null,null,null,22.797678121000018,25.077445933100023,27.357213745200024,29.636981557300032,31.916749369400037,34.196517181500042,36.476284993600039,38.756052805700044,41.035820617800056,43.315588429900053,45.595356242000058,59.607874015748052,null,1,1.1000000000000001,3,2.7272727272727271,2.7272727272727271,1.3636363636363635,null,null,3.9809523809523806,null,null,{"$f":"(U29*2.54)-DataBase!$M$5","v":150.98900000000006}]
[null,"CLUB","MET.PL","PLAY. L","NET.SFT","NET.SFT"]
[null,"#3",{"$f":"'MOI DRY FIT METRIC'!C36","v":97.15000000000002},{"$f":"'MOI DRY FIT METRIC'!D36","v":38.248031496063},{"$f":"'MOI DRY FIT METRIC'!E36","v":36.870078740157489},{"$f":"'MOI DRY FIT METRIC'!F36","v":93.65000000000002}]
[null,"#4",{"$f":"'MOI DRY FIT METRIC'!C37","v":96.200000000000017},{"$f":"'MOI DRY FIT METRIC'!D37","v":37.874015748031503},{"$f":"'MOI DRY FIT METRIC'!E37","v":36.496062992125992},{"$f":"'MOI DRY FIT METRIC'!F37","v":92.700000000000017}]
[null,"#5",{"$f":"'MOI DRY FIT METRIC'!C38","v":95.250000000000014},{"$f":"'MOI DRY FIT METRIC'!D38","v":37.500000000000007},{"$f":"'MOI DRY FIT METRIC'!E38","v":36.122047244094496},{"$f":"'MOI DRY FIT METRIC'!#REF!","v":{"$error":"#REF!"}}]
[null,"#6",{"$f":"'MOI DRY FIT METRIC'!C39","v":94.300000000000011},{"$f":"'MOI DRY FIT METRIC'!D39","v":37.125984251968511},{"$f":"'MOI DRY FIT METRIC'!E39","v":35.748031496062993},{"$f":"'MOI DRY FIT METRIC'!F39","v":90.800000000000011}]
[null,"#7",{"$f":"'MOI DRY FIT METRIC'!C40","v":93.350000000000009},{"$f":"'MOI DRY FIT METRIC'!D40","v":36.751968503937007},{"$f":"'MOI DRY FIT METRIC'!E40","v":35.374015748031496},{"$f":"'MOI DRY FIT METRIC'!F40","v":89.850000000000009}]
[null,"#8",{"$f":"'MOI DRY FIT METRIC'!C41","v":92.4},{"$f":"'MOI DRY FIT METRIC'!D41","v":36.377952755905511},{"$f":"'MOI DRY FIT METRIC'!E41","v":35},{"$f":"'MOI DRY FIT METRIC'!F41","v":88.9}]
[null,"#9",{"$f":"'MOI DRY FIT METRIC'!C42","v":91.45},{"$f":"'MOI DRY FIT METRIC'!D42","v":36.003937007874015},{"$f":"'MOI DRY FIT METRIC'!E42","v":34.625984251968504},{"$f":"'MOI DRY FIT METRIC'!F42","v":87.95}]
[null,"PW",{"$f":"'MOI DRY FIT METRIC'!C43","v":90.820000000000007},{"$f":"'MOI DRY FIT METRIC'!D43","v":35.755905511811029},{"$f":"'MOI DRY FIT METRIC'!E43","v":34.003937007874022},{"$f":"'MOI DRY FIT METRIC'!F43","v":86.370000000000019}]
[null,"GW",{"$f":"'MOI DRY FIT METRIC'!C44","v":90.190000000000012},{"$f":"'MOI DRY FIT METRIC'!D44","v":35.507874015748037},{"$f":"'MOI DRY FIT METRIC'!E44","v":33.755905511811029},{"$f":"'MOI DRY FIT METRIC'!F44","v":85.740000000000023}]
[null,"SW",{"$f":"'MOI DRY FIT METRIC'!C45","v":89.560000000000016},{"$f":"'MOI DRY FIT METRIC'!D45","v":35.259842519685044},{"$f":"'MOI DRY FIT METRIC'!E45","v":33.507874015748044},{"$f":"'MOI DRY FIT METRIC'!F45","v":85.110000000000028}]
[null,"LW",{"$f":"'MOI DRY FIT METRIC'!C46","v":88.930000000000021},{"$f":"'MOI DRY FIT METRIC'!D46","v":35.011811023622052},{"$f":"'MOI DRY FIT METRIC'!E46","v":33.259842519685051},{"$f":"'MOI DRY FIT METRIC'!F46","v":84.480000000000032}]
[]
[]
[null,null,null,null,null,null,null,null,null,"#3","#4","#5","#6","#7","#8","#9","PW","GW","SW","LW"]
[null,null,null,null,null,null,null,null,"CPM",{"$f":"-6*(J9/25.4)","v":7.5118110236220019},6.7559055118109796,5.9999999999999574,5.2440944881889351,4.4881889763779554,3.7322834645669332,2.9763779527559109,2.9645669291338237,2.9527559055117791,2.9409448818897341,2.92913385826769]
[]
[null,null,null,null,null,null,"PLAY LENGTH CHANGE",null,{"$f":"I31","v":0},{"$f":"J9","v":-31.799999999999805},-28.599999999999813,-25.399999999999817,-22.199999999999825,-19.000000000000011,-15.800000000000017,-12.600000000000023,-12.549999999999853,-12.499999999999865,-12.449999999999875,-12.399999999999887]
[null,null,"offsett","choise",null,"change","OFFSET vs STANDARD",null,{"$f":"$C$49","v":0},{"$f":"$C$49","v":0},0,0,0,0,0,0,0,0,0,0]
[null,null,{"$f":"LOOKUP(D49,D50:D70,C50:C70)","v":0},13,null,{"$f":"LOOKUP(D49,D50:D70,E50:E70)","v":0},"CHOICE",null,{"$f":"$D$49","v":13},{"$f":"$D$49","v":13},13,13,13,13,13,13,13,13,13,13]
[null,null,12,1,{"$f":"F50","v":1.5},1.5,"GRAMS SWP AT STD",null,1.84,1.87,1.91,{"$f":"I62","v":1.95},{"$f":"J62","v":1.99},2.0299999999999998,2.0699999999999998,2.11,2.16,2.21,2.2599999999999998,2.31]
[null,null,11,{"$f":"D50+1","v":2},{"$f":"F51","v":1.375},{"$f":"F50-1/8","v":1.375},"GRAMS SWP AT STD",null,{"$f":"(I54-I50)/3+I50","v":1.85},{"$f":"(J54-J50)/3+J50","v":1.8833333333333333},1.9233333333333333,1.9633333333333334,2.0033333333333334,2.043333333333333,2.083333333333333,2.1266666666666665,2.1766666666666667,2.2266666666666666,2.2766666666666664,2.3266666666666667]
[null,null,10,{"$f":"D51+1","v":3},1.25,1.25,"GRAMS SWP AT STD",null,{"$f":"(I54-I50)/3+I51","v":1.86},{"$f":"(J54-J50)/3+J51","v":1.8966666666666665},1.9366666666666668,1.9766666666666668,2.0166666666666666,2.0566666666666662,2.0966666666666662,2.1433333333333331,2.1933333333333334,2.2433333333333332,2.293333333333333,2.3433333333333333]
[null,null,9,4,1.125,1.125,"GRAMS SWP AT STD",null,{"$f":"(I54-I50)/3+I52","v":1.87},{"$f":"(J54-J50)/3+J52","v":1.9099999999999997},1.9500000000000002,1.9900000000000002,2.0299999999999998,2.0699999999999994,2.1099999999999994,2.1599999999999997,2.21,2.2599999999999998,2.3099999999999996,2.36]
[null,null,8,5,1,1,"GRAMS SWP AT STD",null,{"$f":"J50","v":1.87},{"$f":"K50","v":1.91},1.95,1.99,2.0299999999999998,2.0699999999999998,2.11,2.16,2.21,2.2599999999999998,2.31,{"$f":"S58","v":2.36}]
[null,null,7,6,0.875,0.875,"GRAMS SWP AT STD",null,{"$f":"(I58-I54)/3+I54","v":1.8833333333333333},{"$f":"(J58-J54)/3+J54","v":1.9233333333333333},1.9633333333333334,2.0033333333333334,2.043333333333333,2.083333333333333,2.1266666666666665,2.1766666666666667,2.2266666666666666,2.2766666666666664,2.3266666666666667,2.3766666666666665]
[null,null,6,7,0.75,0.75,"GRAMS SWP AT STD",null,{"$f":"(I58-I54)/3+I55","v":1.8966666666666665},{"$f":"(J58-J54)/3+J55","v":1.9366666666666668},1.9766666666666668,2.0166666666666666,2.0566666666666662,2.0966666666666662,2.1433333333333331,2.1933333333333334,2.2433333333333332,2.293333333333333,2.3433333333333333,2.3933333333333331]
[null,null,5,8,0.625,0.625,"GRAMS SWP AT STD",null,{"$f":"(I58-I54)/3+I56","v":1.9099999999999997},{"$f":"(J58-J54)/3+J56","v":1.9500000000000002},1.9900000000000002,2.0299999999999998,2.0699999999999994,2.1099999999999994,2.1599999999999997,2.21,2.2599999999999998,2.3099999999999996,2.36,2.4099999999999997]
[null,null,4,9,0.5,0.5,"GRAMS SWP AT STD",null,{"$f":"J54","v":1.91},{"$f":"K54","v":1.95},1.99,2.0299999999999998,2.0699999999999998,2.11,2.16,2.21,2.2599999999999998,2.31,{"$f":"R62","v":2.36},{"$f":"S62","v":2.41}]
[null,null,3,10,0.375,0.375,"GRAMS SWP AT STD",null,{"$f":"(I62-I58)/3+I58","v":1.9233333333333333},{"$f":"(J62-J58)/3+J58","v":1.9633333333333334},2.0033333333333334,2.043333333333333,2.083333333333333,2.1266666666666665,2.1766666666666667,2.2266666666666666,2.2766666666666664,2.3266666666666667,2.3766666666666665,2.4266666666666667]
[null,null,2,11,0.25,0.25,"GRAMS SWP AT STD",null,{"$f":"(I62-I58)/3+I59","v":1.9366666666666668},{"$f":"(J62-J58)/3+J59","v":1.9766666666666668},2.0166666666666666,2.0566666666666662,2.0966666666666662,2.1433333333333331,2.1933333333333334,2.2433333333333332,2.293333333333333,2.3433333333333333,2.3933333333333331,2.4433333333333334]
[null,null,1,12,0.125,0.125,"GRAMS SWP AT STD",null,{"$f":"(I62-I58)/3+I60","v":1.9500000000000002},{"$f":"(J62-J58)/3+J60","v":1.9900000000000002},2.0299999999999998,2.0699999999999994,2.1099999999999994,2.1599999999999997,2.21,2.2599999999999998,2.3099999999999996,2.36,2.4099999999999997,2.46]
[null,null,0,13,0,0,"GRAMS SWP AT STD",null,1.95,1.99,2.0299999999999998,2.0699999999999998,2.11,2.16,2.21,2.2599999999999998,2.31,2.36,2.41,2.46]
[null,null,-1,14,-0.125,-0.125,"GRAMS SWP AT STD",null,{"$f":"(I66-I62)/3+I62","v":1.9233333333333333},{"$f":"(J66-J62)/3+J62","v":1.9633333333333334},2.003333333333333,2.043333333333333,2.083333333333333,2.13,2.1766666666666667,2.2266666666666666,2.2766666666666668,2.3266666666666667,2.3766666666666669,2.4266666666666667]
[null,null,-2,15,-0.25,-0.25,"GRAMS SWP AT STD",null,{"$f":"(I66-I62)/3+I63","v":1.8966666666666667},{"$f":"(J66-J62)/3+J63","v":1.9366666666666668},1.9766666666666663,2.0166666666666666,2.0566666666666662,2.0999999999999996,2.1433333333333335,2.1933333333333334,2.2433333333333336,2.2933333333333334,2.3433333333333337,2.3933333333333335]
[null,null,-3,16,-0.375,-0.375,"GRAMS SWP AT STD",null,{"$f":"(I66-I62)/3+I64","v":1.87},{"$f":"(J66-J62)/3+J64","v":1.9100000000000001},1.9499999999999997,1.99,2.0299999999999994,2.0699999999999994,2.1100000000000003,2.16,2.2100000000000004,2.2600000000000002,2.3100000000000005,2.3600000000000003]
[null,null,-4,17,-0.5,-0.5,"GRAMS SWP AT STD",null,{"$f":"J50","v":1.87},{"$f":"K50","v":1.91},1.95,1.99,2.0299999999999998,2.0699999999999998,2.11,2.16,2.21,2.2599999999999998,2.31,{"$f":"R62","v":2.36}]
[null,null,-5,18,-0.625,-0.625,"GRAMS SWP AT STD",null,{"$f":"(I70-I66)/3+I66","v":1.9233333333333333},{"$f":"(J70-J66)/3+J66","v":1.9633333333333332},2.0033333333333334,2.0466666666666669,2.09,2.1333333333333333,2.1766666666666667,2.2266666666666666,2.2766666666666668,2.3266666666666667,2.3766666666666665,2.4266666666666667]
[null,null,-6,19,-0.75,-0.75,"GRAMS SWP AT STD",null,{"$f":"(I70-I66)/3+I67","v":1.9766666666666666},{"$f":"(J70-J66)/3+J67","v":2.0166666666666666},2.0566666666666666,2.1033333333333335,2.15,2.1966666666666668,2.2433333333333336,2.293333333333333,2.3433333333333337,2.3933333333333335,2.4433333333333329,2.4933333333333336]
[null,null,-7,20,-0.875,-0.875,"GRAMS SWP AT STD",null,{"$f":"(I70-I66)/3+I68","v":2.0299999999999998},{"$f":"(J70-J66)/3+J68","v":2.0699999999999998},2.11,2.16,2.21,2.2600000000000002,2.3100000000000005,2.3599999999999994,2.4100000000000006,2.4600000000000004,2.5099999999999993,2.5600000000000005]
[null,null,-8,21,-1,-1,"GRAMS SWP AT STD",null,{"$f":"M66","v":2.0299999999999998},{"$f":"N66","v":2.0699999999999998},2.11,2.16,2.21,2.2599999999999998,2.31,2.36,{"$f":"S62","v":2.41},{"$f":"T62","v":2.46},2.5099999999999998,2.56]

{"sheet":"SWC","index":5,"n_rows":703,"n_cols":10,"rows_kept":703,"cut":false,"hidden":true,"merged":[]}
[]
[null,"#","SW","GRAM","BALANCE POINT","GRAM*(BP-14\")","SW INDEX"]
[null,"#3",{"$f":"VLOOKUP(G3,$I$3:$J$703,2)","v":"D3.1"},{"$f":"'MOI DRY FIT METRIC'!J48","v":421},{"$f":"('MOI DRY FIT METRIC'!J49/2.54)","v":28.740157480314959},{"$f":"D3*(E3-14)","v":6205.6062992125981},{"$f":"(F3*0.03528 - 143.5) /1.75","v":43.105022992125974},null,10,"A0.0"]
[null,"#4",{"$f":"VLOOKUP(G4,$I$3:$J$703,2)","v":"D3.4"},{"$f":"'MOI DRY FIT METRIC'!K$48","v":428},{"$f":"('MOI DRY FIT METRIC'!K49/2.54)","v":28.543307086614174},6224.5354330708669,43.486634330708675,null,10.1,"A0.1"]
[null,"#5",{"$f":"VLOOKUP(G5,$I$3:$J$703,2)","v":"D3.2"},{"$f":"'MOI DRY FIT METRIC'!L$48","v":433},{"$f":"('MOI DRY FIT METRIC'!L49)/2.54","v":28.346456692913385},6212.0157480314956,43.234237480314945,null,10.199999999999999,"A0.2"]
[null,"#6","D3.2",{"$f":"'MOI DRY FIT METRIC'!M$48","v":439},{"$f":"'MOI DRY FIT METRIC'!M49/2.54","v":28.149606299212596},6211.6771653543301,43.227411653543285,null,10.3,"A0.3"]
[null,"#7","D3.1",{"$f":"'MOI DRY FIT METRIC'!N$48","v":445},{"$f":"'MOI DRY FIT METRIC'!N49/2.54","v":27.952755905511811},6208.9763779527557,43.172963779527549,null,10.4,"A0.4"]
[null,"#8","D3.0",{"$f":"'MOI DRY FIT METRIC'!O$48","v":451},{"$f":"'MOI DRY FIT METRIC'!O49/2.54","v":27.755905511811022},6203.9133858267714,43.070893858267709,null,10.5,"A0.5"]
[null,"#9","D2.9",{"$f":"'MOI DRY FIT METRIC'!P$48","v":457},{"$f":"'MOI DRY FIT METRIC'!P49/2.54","v":27.559055118110237},6196.4881889763783,42.921201889763779,null,10.6,"A0.6"]
[null,"PW","D3.5",{"$f":"'MOI DRY FIT METRIC'!Q$48","v":466},{"$f":"'MOI DRY FIT METRIC'!Q49/2.54","v":27.362204724409448},6226.787401574803,43.532034015748017,null,10.7,"A0.7"]
[null,"GW","D3.2",{"$f":"'MOI DRY FIT METRIC'!R$48","v":472},{"$f":"'MOI DRY FIT METRIC'!R49/2.54","v":27.165354330708659},6214.0472440944868,43.275192440944856,null,10.8,"A0.8"]
[null,"SW","D4.8",{"$f":"'MOI DRY FIT METRIC'!S$48","v":478},{"$f":"'MOI DRY FIT METRIC'!S49/2.54","v":27.165354330708659},6293.039370078739,44.867673700787385,null,10.9,"A0.9"]
[null,"LW","D5.3",{"$f":"'MOI DRY FIT METRIC'!T$48","v":480},{"$f":"'MOI DRY FIT METRIC'!T49/2.54","v":27.165354330708659},{"$f":"D13*(E13-14)","v":6319.3700787401567},{"$f":"(F13*0.03528 - 143.5) /1.75","v":45.398500787401545},null,11,"A1.0"]
[null,"x","D3.2",{"$f":"'MOI DRY FIT METRIC'!D48","v":338.2},{"$f":"'MOI DRY FIT METRIC'!D49/2.54","v":32.374015748031496},{"$f":"D14*(E14-14)","v":6214.0921259842517},{"$f":"(F14*0.03528 - 143.5) /1.75","v":43.276097259842508},null,11.1,"A1.1"]
["T","x",{"$f":"VLOOKUP(G15,$I$3:$J$703,2)","v":{"$error":"#REF!"}},{"$f":"#REF!","v":{"$error":"#REF!"}},{"$f":"#REF!/2.54","v":{"$error":"#REF!"}},{"$f":"D15*(E15-14)","v":{"$error":"#REF!"}},{"$f":"(F15*0.03528 - 143.5) /1.75","v":{"$error":"#REF!"}},null,11.2,"A1.2"]
["T","x",{"$f":"VLOOKUP(G16,$I$3:$J$703,2)","v":{"$error":"#REF!"}},{"$f":"#REF!","v":{"$error":"#REF!"}},{"$f":"#REF!/2.54","v":{"$error":"#REF!"}},{"$f":"D16*(E16-14)","v":{"$error":"#REF!"}},{"$f":"(F16*0.03528 - 143.5) /1.75","v":{"$error":"#REF!"}},null,11.3,"A1.3"]
["T","x",{"$error":"#REF!"},{"$f":"#REF!","v":{"$error":"#REF!"}},{"$f":"#REF!/2.54","v":{"$error":"#REF!"}},{"$error":"#REF!"},{"$error":"#REF!"},null,11.4,"A1.4"]
["T","x",{"$error":"#REF!"},{"$f":"#REF!","v":{"$error":"#REF!"}},{"$f":"#REF!/2.54","v":{"$error":"#REF!"}},{"$error":"#REF!"},{"$error":"#REF!"},null,11.5,"A1.5"]
["T","x",{"$error":"#REF!"},{"$f":"#REF!","v":{"$error":"#REF!"}},{"$f":"#REF!/2.54","v":{"$error":"#REF!"}},{"$error":"#REF!"},{"$error":"#REF!"},null,11.6,"A1.6"]
["T","x",{"$error":"#REF!"},{"$f":"#REF!","v":{"$error":"#REF!"}},{"$f":"#REF!/2.54","v":{"$error":"#REF!"}},{"$error":"#REF!"},{"$error":"#REF!"},null,11.7,"A1.7"]
["T","x",{"$error":"#REF!"},{"$f":"#REF!","v":{"$error":"#REF!"}},{"$f":"#REF!/2.54","v":{"$error":"#REF!"}},{"$error":"#REF!"},{"$error":"#REF!"},null,11.8,"A1.8"]
["T","x",{"$error":"#REF!"},{"$f":"#REF!","v":{"$error":"#REF!"}},{"$f":"#REF!/2.54","v":{"$error":"#REF!"}},{"$error":"#REF!"},{"$error":"#REF!"},null,11.9,"A1.9"]
["T","x",{"$error":"#REF!"},{"$f":"#REF!","v":{"$error":"#REF!"}},{"$f":"#REF!/2.54","v":{"$error":"#REF!"}},{"$error":"#REF!"},{"$error":"#REF!"},null,12,"A2.0"]
["T","x",{"$error":"#REF!"},{"$f":"#REF!","v":{"$error":"#REF!"}},{"$f":"#REF!/2.54","v":{"$error":"#REF!"}},{"$error":"#REF!"},{"$error":"#REF!"},null,12.1,"A2.1"]
["T","x",{"$error":"#REF!"},{"$f":"#REF!","v":{"$error":"#REF!"}},{"$f":"#REF!/2.54","v":{"$error":"#REF!"}},{"$error":"#REF!"},{"$error":"#REF!"},null,12.2,"A2.2"]
["T","x",{"$error":"#REF!"},{"$f":"#REF!","v":{"$error":"#REF!"}},{"$f":"#REF!/2.54","v":{"$error":"#REF!"}},{"$error":"#REF!"},{"$error":"#REF!"},null,12.3,"A2.3"]
["T","x",{"$error":"#REF!"},{"$f":"#REF!","v":{"$error":"#REF!"}},{"$f":"#REF!/2.54","v":{"$error":"#REF!"}},{"$error":"#REF!"},{"$error":"#REF!"},null,12.4,"A2.4"]
["T","x",{"$error":"#REF!"},{"$f":"#REF!","v":{"$error":"#REF!"}},{"$f":"#REF!/2.54","v":{"$error":"#REF!"}},{"$error":"#REF!"},{"$error":"#REF!"},null,12.5,"A2.5"]
["T","x",{"$error":"#REF!"},{"$f":"#REF!","v":{"$error":"#REF!"}},{"$f":"#REF!/2.54","v":{"$error":"#REF!"}},{"$error":"#REF!"},{"$error":"#REF!"},null,12.6,"A2.6"]
["T","x",{"$error":"#REF!"},{"$f":"#REF!","v":{"$error":"#REF!"}},{"$f":"#REF!/2.54","v":{"$error":"#REF!"}},{"$error":"#REF!"},{"$error":"#REF!"},null,12.7,"A2.7"]
["T","x",{"$error":"#REF!"},{"$f":"#REF!","v":{"$error":"#REF!"}},{"$f":"#REF!/2.54","v":{"$error":"#REF!"}},{"$error":"#REF!"},{"$error":"#REF!"},null,12.8,"A2.8"]
["T","x",{"$error":"#REF!"},{"$f":"#REF!","v":{"$error":"#REF!"}},{"$f":"#REF!/2.54","v":{"$error":"#REF!"}},{"$error":"#REF!"},{"$error":"#REF!"},null,12.9,"A2.9"]
["T","x",{"$error":"#REF!"},{"$f":"#REF!","v":{"$error":"#REF!"}},{"$f":"#REF!/2.54","v":{"$error":"#REF!"}},{"$error":"#REF!"},{"$error":"#REF!"},null,13,"A3.0"]
["T","x",{"$error":"#REF!"},{"$f":"#REF!","v":{"$error":"#REF!"}},{"$f":"#REF!/2.54","v":{"$error":"#REF!"}},{"$error":"#REF!"},{"$error":"#REF!"},null,13.1,"A3.1"]
["T","x",{"$error":"#REF!"},{"$f":"#REF!","v":{"$error":"#REF!"}},{"$f":"#REF!/2.54","v":{"$error":"#REF!"}},{"$error":"#REF!"},{"$error":"#REF!"},null,13.2,"A3.2"]
["T","x",{"$error":"#REF!"},{"$f":"#REF!","v":{"$error":"#REF!"}},{"$f":"#REF!/2.54","v":{"$error":"#REF!"}},{"$error":"#REF!"},{"$error":"#REF!"},null,13.3,"A3.3"]
["T","x",{"$error":"#REF!"},{"$f":"#REF!","v":{"$error":"#REF!"}},{"$f":"#REF!/2.54","v":{"$error":"#REF!"}},{"$error":"#REF!"},{"$error":"#REF!"},null,13.4,"A3.4"]
["T","x",{"$error":"#REF!"},{"$f":"#REF!","v":{"$error":"#REF!"}},{"$f":"#REF!/2.54","v":{"$error":"#REF!"}},{"$error":"#REF!"},{"$error":"#REF!"},null,13.5,"A3.5"]
["T","x",{"$error":"#REF!"},{"$f":"#REF!","v":{"$error":"#REF!"}},{"$f":"#REF!/2.54","v":{"$error":"#REF!"}},{"$error":"#REF!"},{"$error":"#REF!"},null,13.6,"A3.6"]
["T","x",{"$error":"#REF!"},{"$f":"#REF!","v":{"$error":"#REF!"}},{"$f":"#REF!/2.54","v":{"$error":"#REF!"}},{"$error":"#REF!"},{"$error":"#REF!"},null,13.7,"A3.7"]
["T","x",{"$error":"#REF!"},{"$f":"#REF!","v":{"$error":"#REF!"}},{"$f":"#REF!/2.54","v":{"$error":"#REF!"}},{"$error":"#REF!"},{"$error":"#REF!"},null,13.8,"A3.8"]
["T","x",{"$error":"#REF!"},{"$f":"#REF!","v":{"$error":"#REF!"}},{"$f":"#REF!/2.54","v":{"$error":"#REF!"}},{"$error":"#REF!"},{"$error":"#REF!"},null,13.9,"A3.9"]
["T","x",{"$error":"#REF!"},{"$f":"#REF!","v":{"$error":"#REF!"}},{"$f":"#REF!/2.54","v":{"$error":"#REF!"}},{"$error":"#REF!"},{"$error":"#REF!"},null,14,"A4.0"]
["T","x",{"$error":"#REF!"},{"$f":"#REF!","v":{"$error":"#REF!"}},{"$f":"#REF!/2.54","v":{"$error":"#REF!"}},{"$error":"#REF!"},{"$error":"#REF!"},null,14.1,"A4.1"]
["T","x",{"$error":"#REF!"},{"$f":"#REF!","v":{"$error":"#REF!"}},{"$f":"#REF!/2.54","v":{"$error":"#REF!"}},{"$error":"#REF!"},{"$error":"#REF!"},null,14.2,"A4.2"]
["T","x",{"$error":"#REF!"},{"$f":"#REF!","v":{"$error":"#REF!"}},{"$f":"#REF!/2.54","v":{"$error":"#REF!"}},{"$error":"#REF!"},{"$error":"#REF!"},null,14.3,"A4.3"]
["T","x",{"$error":"#REF!"},{"$f":"#REF!","v":{"$error":"#REF!"}},{"$f":"#REF!/2.54","v":{"$error":"#REF!"}},{"$error":"#REF!"},{"$error":"#REF!"},null,14.4,"A4.4"]
["T","x",{"$error":"#REF!"},{"$f":"#REF!","v":{"$error":"#REF!"}},{"$f":"#REF!/2.54","v":{"$error":"#REF!"}},{"$error":"#REF!"},{"$error":"#REF!"},null,14.5,"A4.5"]
["T","x",{"$error":"#REF!"},{"$f":"#REF!","v":{"$error":"#REF!"}},{"$f":"#REF!/2.54","v":{"$error":"#REF!"}},{"$error":"#REF!"},{"$error":"#REF!"},null,14.6,"A4.6"]
["T","x",{"$error":"#REF!"},{"$f":"#REF!","v":{"$error":"#REF!"}},{"$f":"#REF!/2.54","v":{"$error":"#REF!"}},{"$error":"#REF!"},{"$error":"#REF!"},null,14.7,"A4.7"]
["T","x",{"$error":"#REF!"},{"$f":"#REF!","v":{"$error":"#REF!"}},{"$f":"#REF!/2.54","v":{"$error":"#REF!"}},{"$error":"#REF!"},{"$error":"#REF!"},null,14.8,"A4.8"]
["T","x",{"$error":"#REF!"},{"$f":"#REF!","v":{"$error":"#REF!"}},{"$f":"#REF!/2.54","v":{"$error":"#REF!"}},{"$error":"#REF!"},{"$error":"#REF!"},null,14.9,"A4.9"]
["T","x",{"$error":"#REF!"},{"$f":"#REF!","v":{"$error":"#REF!"}},{"$f":"#REF!/2.54","v":{"$error":"#REF!"}},{"$error":"#REF!"},{"$error":"#REF!"},null,15,"A5.0"]
["T","x",{"$error":"#REF!"},{"$f":"#REF!","v":{"$error":"#REF!"}},{"$f":"#REF!/2.54","v":{"$error":"#REF!"}},{"$error":"#REF!"},{"$error":"#REF!"},null,15.1,"A5.1"]
["T","x",{"$error":"#REF!"},{"$f":"#REF!","v":{"$error":"#REF!"}},{"$f":"#REF!/2.54","v":{"$error":"#REF!"}},{"$error":"#REF!"},{"$error":"#REF!"},null,15.2,"A5.2"]
["T","x",{"$error":"#REF!"},{"$f":"#REF!","v":{"$error":"#REF!"}},{"$f":"#REF!/2.54","v":{"$error":"#REF!"}},{"$error":"#REF!"},{"$error":"#REF!"},null,15.3,"A5.3"]
["T","x",{"$error":"#REF!"},{"$f":"#REF!","v":{"$error":"#REF!"}},{"$f":"#REF!/2.54","v":{"$error":"#REF!"}},{"$error":"#REF!"},{"$error":"#REF!"},null,15.4,"A5.4"]
["T","x",{"$error":"#REF!"},{"$f":"#REF!","v":{"$error":"#REF!"}},{"$f":"#REF!/2.54","v":{"$error":"#REF!"}},{"$error":"#REF!"},{"$error":"#REF!"},null,15.5,"A5.5"]
["T","x",{"$error":"#REF!"},{"$f":"#REF!","v":{"$error":"#REF!"}},{"$f":"#REF!/2.54","v":{"$error":"#REF!"}},{"$error":"#REF!"},{"$error":"#REF!"},null,15.6,"A5.6"]
["T","x",{"$error":"#REF!"},{"$f":"#REF!","v":{"$error":"#REF!"}},{"$f":"#REF!/2.54","v":{"$error":"#REF!"}},{"$error":"#REF!"},{"$error":"#REF!"},null,15.7,"A5.7"]
["T","x",{"$error":"#REF!"},{"$f":"#REF!","v":{"$error":"#REF!"}},{"$f":"#REF!/2.54","v":{"$error":"#REF!"}},{"$error":"#REF!"},{"$error":"#REF!"},null,15.8,"A5.8"]
["T","x",{"$error":"#REF!"},{"$f":"#REF!","v":{"$error":"#REF!"}},{"$f":"#REF!/2.54","v":{"$error":"#REF!"}},{"$error":"#REF!"},{"$error":"#REF!"},null,15.9,"A5.9"]
["T","x",{"$error":"#REF!"},{"$f":"#REF!","v":{"$error":"#REF!"}},{"$f":"#REF!/2.54","v":{"$error":"#REF!"}},{"$error":"#REF!"},{"$error":"#REF!"},null,16,"A6.0"]
["T","x",{"$error":"#REF!"},{"$f":"#REF!","v":{"$error":"#REF!"}},{"$f":"#REF!/2.54","v":{"$error":"#REF!"}},{"$error":"#REF!"},{"$error":"#REF!"},null,16.100000000000001,"A6.1"]
["T","x",{"$error":"#REF!"},{"$f":"#REF!","v":{"$error":"#REF!"}},{"$f":"#REF!/2.54","v":{"$error":"#REF!"}},{"$error":"#REF!"},{"$error":"#REF!"},null,16.2,"A6.2"]
["T","x",{"$error":"#REF!"},{"$f":"#REF!","v":{"$error":"#REF!"}},{"$f":"#REF!/2.54","v":{"$error":"#REF!"}},{"$error":"#REF!"},{"$error":"#REF!"},null,16.3,"A6.3"]
["T","x",{"$error":"#REF!"},{"$f":"#REF!","v":{"$error":"#REF!"}},{"$f":"#REF!/2.54","v":{"$error":"#REF!"}},{"$error":"#REF!"},{"$error":"#REF!"},null,16.399999999999999,"A6.4"]
["T","x",{"$error":"#REF!"},{"$f":"#REF!","v":{"$error":"#REF!"}},{"$f":"#REF!/2.54","v":{"$error":"#REF!"}},{"$error":"#REF!"},{"$error":"#REF!"},null,16.5,"A6.5"]
["T","x",{"$error":"#REF!"},{"$f":"#REF!","v":{"$error":"#REF!"}},{"$f":"#REF!/2.54","v":{"$error":"#REF!"}},{"$error":"#REF!"},{"$error":"#REF!"},null,16.600000000000001,"A6.6"]
["T","x",{"$error":"#REF!"},{"$f":"#REF!","v":{"$error":"#REF!"}},{"$f":"#REF!/2.54","v":{"$error":"#REF!"}},{"$error":"#REF!"},{"$error":"#REF!"},null,16.7,"A6.7"]
["T","x",{"$error":"#REF!"},{"$f":"#REF!","v":{"$error":"#REF!"}},{"$f":"#REF!/2.54","v":{"$error":"#REF!"}},{"$error":"#REF!"},{"$error":"#REF!"},null,16.8,"A6.8"]
["T","x",{"$error":"#REF!"},{"$f":"#REF!","v":{"$error":"#REF!"}},{"$f":"#REF!/2.54","v":{"$error":"#REF!"}},{"$error":"#REF!"},{"$error":"#REF!"},null,16.899999999999999,"A6.9"]
["T","x",{"$error":"#REF!"},{"$f":"#REF!","v":{"$error":"#REF!"}},{"$f":"#REF!/2.54","v":{"$error":"#REF!"}},{"$error":"#REF!"},{"$error":"#REF!"},null,17,"A7.0"]
["T","x",{"$error":"#REF!"},{"$f":"#REF!","v":{"$error":"#REF!"}},{"$f":"#REF!/2.54","v":{"$error":"#REF!"}},{"$error":"#REF!"},{"$error":"#REF!"},null,17.100000000000001,"A7.1"]
["T","x",{"$error":"#REF!"},{"$f":"#REF!","v":{"$error":"#REF!"}},{"$f":"#REF!/2.54","v":{"$error":"#REF!"}},{"$error":"#REF!"},{"$error":"#REF!"},null,17.2,"A7.2"]
["T","x",{"$error":"#REF!"},{"$f":"#REF!","v":{"$error":"#REF!"}},{"$f":"#REF!/2.54","v":{"$error":"#REF!"}},{"$error":"#REF!"},{"$error":"#REF!"},null,17.3,"A7.3"]
["T","x",{"$error":"#REF!"},{"$f":"#REF!","v":{"$error":"#REF!"}},{"$f":"#REF!/2.54","v":{"$error":"#REF!"}},{"$error":"#REF!"},{"$error":"#REF!"},null,17.399999999999999,"A7.4"]
["T","x",{"$error":"#REF!"},{"$f":"#REF!","v":{"$error":"#REF!"}},{"$f":"#REF!/2.54","v":{"$error":"#REF!"}},{"$error":"#REF!"},{"$error":"#REF!"},null,17.5,"A7.5"]
["T","x",{"$error":"#REF!"},{"$f":"#REF!","v":{"$error":"#REF!"}},{"$f":"#REF!/2.54","v":{"$error":"#REF!"}},{"$error":"#REF!"},{"$error":"#REF!"},null,17.600000000000001,"A7.6"]
["T","x",{"$f":"VLOOKUP(G80,$I$3:$J$703,2)","v":{"$error":"#REF!"}},{"$f":"#REF!","v":{"$error":"#REF!"}},{"$f":"#REF!/2.54","v":{"$error":"#REF!"}},{"$f":"D80*(E80-14)","v":{"$error":"#REF!"}},{"$f":"(F80*0.03528 - 143.5) /1.75","v":{"$error":"#REF!"}},null,17.7,"A7.7"]
["T","x",{"$error":"#REF!"},{"$f":"#REF!","v":{"$error":"#REF!"}},{"$f":"#REF!/2.54","v":{"$error":"#REF!"}},{"$error":"#REF!"},{"$error":"#REF!"},null,17.8,"A7.8"]
["T","x",{"$error":"#REF!"},{"$f":"#REF!","v":{"$error":"#REF!"}},{"$f":"#REF!/2.54","v":{"$error":"#REF!"}},{"$error":"#REF!"},{"$error":"#REF!"},null,17.899999999999999,"A7.9"]
["T","x",{"$error":"#REF!"},{"$f":"#REF!","v":{"$error":"#REF!"}},{"$f":"#REF!/2.54","v":{"$error":"#REF!"}},{"$error":"#REF!"},{"$error":"#REF!"},null,18,"A8.0"]
["T","x",{"$error":"#REF!"},{"$f":"#REF!","v":{"$error":"#REF!"}},{"$f":"#REF!/2.54","v":{"$error":"#REF!"}},{"$error":"#REF!"},{"$error":"#REF!"},null,18.100000000000001,"A8.1"]
["T","x",{"$error":"#REF!"},{"$f":"#REF!","v":{"$error":"#REF!"}},{"$f":"#REF!/2.54","v":{"$error":"#REF!"}},{"$error":"#REF!"},{"$error":"#REF!"},null,18.2,"A8.2"]
["T","x",{"$error":"#REF!"},{"$f":"#REF!","v":{"$error":"#REF!"}},{"$f":"#REF!/2.54","v":{"$error":"#REF!"}},{"$error":"#REF!"},{"$error":"#REF!"},null,18.3,"A8.3"]
["T","x",{"$error":"#REF!"},{"$f":"#REF!","v":{"$error":"#REF!"}},{"$f":"#REF!/2.54","v":{"$error":"#REF!"}},{"$error":"#REF!"},{"$error":"#REF!"},null,18.399999999999999,"A8.4"]
["T","x",{"$error":"#REF!"},{"$f":"#REF!","v":{"$error":"#REF!"}},{"$f":"#REF!/2.54","v":{"$error":"#REF!"}},{"$error":"#REF!"},{"$error":"#REF!"},null,18.5,"A8.5"]
["T","x",{"$error":"#REF!"},{"$f":"#REF!","v":{"$error":"#REF!"}},{"$f":"#REF!/2.54","v":{"$error":"#REF!"}},{"$error":"#REF!"},{"$error":"#REF!"},null,18.600000000000001,"A8.6"]
["T","x",{"$error":"#REF!"},{"$f":"#REF!","v":{"$error":"#REF!"}},{"$f":"#REF!/2.54","v":{"$error":"#REF!"}},{"$error":"#REF!"},{"$error":"#REF!"},null,18.7,"A8.7"]
["T","x",{"$error":"#REF!"},{"$f":"#REF!","v":{"$error":"#REF!"}},{"$f":"#REF!/2.54","v":{"$error":"#REF!"}},{"$error":"#REF!"},{"$error":"#REF!"},null,18.8,"A8.8"]
["T","x",{"$error":"#REF!"},{"$f":"#REF!","v":{"$error":"#REF!"}},{"$f":"#REF!/2.54","v":{"$error":"#REF!"}},{"$error":"#REF!"},{"$error":"#REF!"},null,18.899999999999999,"A8.9"]
["T","x",{"$error":"#REF!"},{"$f":"#REF!","v":{"$error":"#REF!"}},{"$f":"#REF!/2.54","v":{"$error":"#REF!"}},{"$error":"#REF!"},{"$error":"#REF!"},null,19,"A9.0"]
["T","x",{"$error":"#REF!"},{"$f":"#REF!","v":{"$error":"#REF!"}},{"$f":"#REF!/2.54","v":{"$error":"#REF!"}},{"$error":"#REF!"},{"$error":"#REF!"},null,19.100000000000001,"A9.1"]
["T","x",{"$error":"#REF!"},{"$f":"#REF!","v":{"$error":"#REF!"}},{"$f":"#REF!/2.54","v":{"$error":"#REF!"}},{"$error":"#REF!"},{"$error":"#REF!"},null,19.2,"A9.2"]
["T","x",{"$error":"#REF!"},{"$f":"#REF!","v":{"$error":"#REF!"}},{"$f":"#REF!/2.54","v":{"$error":"#REF!"}},{"$error":"#REF!"},{"$error":"#REF!"},null,19.3,"A9.3"]
["T","x",{"$error":"#REF!"},{"$f":"#REF!","v":{"$error":"#REF!"}},{"$f":"#REF!/2.54","v":{"$error":"#REF!"}},{"$error":"#REF!"},{"$error":"#REF!"},null,19.399999999999999,"A9.4"]
["T","x",{"$error":"#REF!"},{"$f":"#REF!","v":{"$error":"#REF!"}},{"$f":"#REF!/2.54","v":{"$error":"#REF!"}},{"$error":"#REF!"},{"$error":"#REF!"},null,19.5,"A9.5"]
["T","x",{"$error":"#REF!"},{"$f":"#REF!","v":{"$error":"#REF!"}},{"$f":"#REF!/2.54","v":{"$error":"#REF!"}},{"$error":"#REF!"},{"$error":"#REF!"},null,19.600000000000001,"A9.6"]
["T","x",{"$error":"#REF!"},{"$f":"#REF!","v":{"$error":"#REF!"}},{"$f":"#REF!/2.54","v":{"$error":"#REF!"}},{"$error":"#REF!"},{"$error":"#REF!"},null,19.7,"A9.7"]
["T","x",{"$error":"#REF!"},{"$f":"#REF!","v":{"$error":"#REF!"}},{"$f":"#REF!/2.54","v":{"$error":"#REF!"}},{"$error":"#REF!"},{"$error":"#REF!"},null,19.8,"A9.8"]
["T","x",{"$error":"#REF!"},{"$f":"#REF!","v":{"$error":"#REF!"}},{"$f":"#REF!/2.54","v":{"$error":"#REF!"}},{"$error":"#REF!"},{"$error":"#REF!"},null,19.899999999999999,"A9.9"]
["T","x",{"$error":"#REF!"},{"$f":"#REF!","v":{"$error":"#REF!"}},{"$f":"#REF!/2.54","v":{"$error":"#REF!"}},{"$error":"#REF!"},{"$error":"#REF!"},null,20,"B0.0"]
["T","x",{"$error":"#REF!"},{"$f":"#REF!","v":{"$error":"#REF!"}},{"$f":"#REF!/2.54","v":{"$error":"#REF!"}},{"$error":"#REF!"},{"$error":"#REF!"},null,20.100000000000001,"B0.1"]
["T","x",{"$error":"#REF!"},{"$f":"#REF!","v":{"$error":"#REF!"}},{"$f":"#REF!/2.54","v":{"$error":"#REF!"}},{"$error":"#REF!"},{"$error":"#REF!"},null,20.2,"B0.2"]
["T","x",{"$error":"#REF!"},{"$f":"#REF!","v":{"$error":"#REF!"}},{"$f":"#REF!/2.54","v":{"$error":"#REF!"}},{"$error":"#REF!"},{"$error":"#REF!"},null,20.3,"B0.3"]
["T","x",{"$error":"#REF!"},{"$f":"#REF!","v":{"$error":"#REF!"}},{"$f":"#REF!/2.54","v":{"$error":"#REF!"}},{"$error":"#REF!"},{"$error":"#REF!"},null,20.399999999999999,"B0.4"]
["T","x",{"$error":"#REF!"},{"$f":"#REF!","v":{"$error":"#REF!"}},{"$f":"#REF!/2.54","v":{"$error":"#REF!"}},{"$error":"#REF!"},{"$error":"#REF!"},null,20.5,"B0.5"]
["T","x",{"$error":"#REF!"},{"$f":"#REF!","v":{"$error":"#REF!"}},{"$f":"#REF!/2.54","v":{"$error":"#REF!"}},{"$error":"#REF!"},{"$error":"#REF!"},null,20.6,"B0.6"]
["T","x",{"$error":"#REF!"},{"$f":"#REF!","v":{"$error":"#REF!"}},{"$f":"#REF!/2.54","v":{"$error":"#REF!"}},{"$error":"#REF!"},{"$error":"#REF!"},null,20.7,"B0.7"]
["T","x",{"$error":"#REF!"},{"$f":"#REF!","v":{"$error":"#REF!"}},{"$f":"#REF!/2.54","v":{"$error":"#REF!"}},{"$error":"#REF!"},{"$error":"#REF!"},null,20.8,"B0.8"]
["T","x",{"$error":"#REF!"},{"$f":"#REF!","v":{"$error":"#REF!"}},{"$f":"#REF!/2.54","v":{"$error":"#REF!"}},{"$error":"#REF!"},{"$error":"#REF!"},null,20.9,"B0.9"]
["T","x",{"$error":"#REF!"},{"$f":"#REF!","v":{"$error":"#REF!"}},{"$f":"#REF!/2.54","v":{"$error":"#REF!"}},{"$error":"#REF!"},{"$error":"#REF!"},null,21,"B1.0"]
["T","x",{"$error":"#REF!"},{"$f":"#REF!","v":{"$error":"#REF!"}},{"$f":"#REF!/2.54","v":{"$error":"#REF!"}},{"$error":"#REF!"},{"$error":"#REF!"},null,21.1,"B1.1"]
["T","x",{"$error":"#REF!"},{"$f":"#REF!","v":{"$error":"#REF!"}},{"$f":"#REF!/2.54","v":{"$error":"#REF!"}},{"$error":"#REF!"},{"$error":"#REF!"},null,21.2,"B1.2"]
["T","x",{"$error":"#REF!"},{"$f":"#REF!","v":{"$error":"#REF!"}},{"$f":"#REF!/2.54","v":{"$error":"#REF!"}},{"$error":"#REF!"},{"$error":"#REF!"},null,21.3,"B1.3"]
["T","x",{"$error":"#REF!"},{"$f":"#REF!","v":{"$error":"#REF!"}},{"$f":"#REF!/2.54","v":{"$error":"#REF!"}},{"$error":"#REF!"},{"$error":"#REF!"},null,21.4,"B1.4"]
["T","x",{"$error":"#REF!"},{"$f":"#REF!","v":{"$error":"#REF!"}},{"$f":"#REF!/2.54","v":{"$error":"#REF!"}},{"$error":"#REF!"},{"$error":"#REF!"},null,21.5,"B1.5"]
["T","x",{"$error":"#REF!"},{"$f":"#REF!","v":{"$error":"#REF!"}},{"$f":"#REF!/2.54","v":{"$error":"#REF!"}},{"$error":"#REF!"},{"$error":"#REF!"},null,21.6,"B1.6"]
["T","x",{"$error":"#REF!"},{"$f":"#REF!","v":{"$error":"#REF!"}},{"$f":"#REF!/2.54","v":{"$error":"#REF!"}},{"$error":"#REF!"},{"$error":"#REF!"},null,21.7,"B1.7"]
["T","x",{"$error":"#REF!"},{"$f":"#REF!","v":{"$error":"#REF!"}},{"$f":"#REF!/2.54","v":{"$error":"#REF!"}},{"$error":"#REF!"},{"$error":"#REF!"},null,21.8,"B1.8"]
["T","x",{"$error":"#REF!"},{"$f":"#REF!","v":{"$error":"#REF!"}},{"$f":"#REF!/2.54","v":{"$error":"#REF!"}},{"$error":"#REF!"},{"$error":"#REF!"},null,21.9,"B1.9"]
["T","x",{"$error":"#REF!"},{"$f":"#REF!","v":{"$error":"#REF!"}},{"$f":"#REF!/2.54","v":{"$error":"#REF!"}},{"$error":"#REF!"},{"$error":"#REF!"},null,22,"B2.0"]
["T","x",{"$error":"#REF!"},{"$f":"#REF!","v":{"$error":"#REF!"}},{"$f":"#REF!/2.54","v":{"$error":"#REF!"}},{"$error":"#REF!"},{"$error":"#REF!"},null,22.1,"B2.1"]
["T","x",{"$error":"#REF!"},{"$f":"#REF!","v":{"$error":"#REF!"}},{"$f":"#REF!/2.54","v":{"$error":"#REF!"}},{"$error":"#REF!"},{"$error":"#REF!"},null,22.2,"B2.2"]
["T","x",{"$error":"#REF!"},{"$f":"#REF!","v":{"$error":"#REF!"}},{"$f":"#REF!/2.54","v":{"$error":"#REF!"}},{"$error":"#REF!"},{"$error":"#REF!"},null,22.3,"B2.3"]
["T","x",{"$error":"#REF!"},{"$f":"#REF!","v":{"$error":"#REF!"}},{"$f":"#REF!/2.54","v":{"$error":"#REF!"}},{"$error":"#REF!"},{"$error":"#REF!"},null,22.4,"B2.4"]
["T","x",{"$error":"#REF!"},{"$f":"#REF!","v":{"$error":"#REF!"}},{"$f":"#REF!/2.54","v":{"$error":"#REF!"}},{"$error":"#REF!"},{"$error":"#REF!"},null,22.5,"B2.5"]
["T","x",{"$error":"#REF!"},{"$f":"#REF!","v":{"$error":"#REF!"}},{"$f":"#REF!/2.54","v":{"$error":"#REF!"}},{"$error":"#REF!"},{"$error":"#REF!"},null,22.6,"B2.6"]
["T","x",{"$error":"#REF!"},{"$f":"#REF!","v":{"$error":"#REF!"}},{"$f":"#REF!/2.54","v":{"$error":"#REF!"}},{"$error":"#REF!"},{"$error":"#REF!"},null,22.7,"B2.7"]
["T","x",{"$error":"#REF!"},{"$f":"#REF!","v":{"$error":"#REF!"}},{"$f":"#REF!/2.54","v":{"$error":"#REF!"}},{"$error":"#REF!"},{"$error":"#REF!"},null,22.8,"B2.8"]
["T","x",{"$error":"#REF!"},{"$f":"#REF!","v":{"$error":"#REF!"}},{"$f":"#REF!/2.54","v":{"$error":"#REF!"}},{"$error":"#REF!"},{"$error":"#REF!"},null,22.9,"B2.9"]
["T","x",{"$error":"#REF!"},{"$f":"#REF!","v":{"$error":"#REF!"}},{"$f":"#REF!/2.54","v":{"$error":"#REF!"}},{"$error":"#REF!"},{"$error":"#REF!"},null,23,"B3.0"]
["T","x",{"$error":"#REF!"},{"$f":"#REF!","v":{"$error":"#REF!"}},{"$f":"#REF!/2.54","v":{"$error":"#REF!"}},{"$error":"#REF!"},{"$error":"#REF!"},null,23.1,"B3.1"]
[null,null,null,null,null,null,null,null,23.2,"B3.2"]
[null,null,null,null,null,null,null,null,23.3,"B3.3"]
[null,null,null,null,null,null,null,null,23.4,"B3.4"]
[null,null,null,null,null,null,null,null,23.5,"B3.5"]
[null,null,null,null,null,null,null,null,23.6,"B3.6"]
[null,null,null,null,null,null,null,null,23.7,"B3.7"]
[null,null,null,null,null,null,null,null,23.8,"B3.8"]
[null,null,null,null,null,null,null,null,23.9,"B3.9"]
[null,null,null,null,null,null,null,null,24,"B4.0"]
[null,null,null,null,null,null,null,null,24.099999999999898,"B4.1"]
[null,null,null,null,null,null,null,null,24.1999999999999,"B4.2"]
[null,null,null,null,null,null,null,null,24.299999999999901,"B4.3"]
[null,null,null,null,null,null,null,null,24.399999999999899,"B4.4"]
[null,null,null,null,null,null,null,null,24.499999999999901,"B4.5"]
[null,null,null,null,null,null,null,null,24.599999999999898,"B4.6"]
[null,null,null,null,null,null,null,null,24.6999999999999,"B4.7"]
[null,null,null,null,null,null,null,null,24.799999999999901,"B4.8"]
[null,null,null,null,null,null,null,null,24.899999999999899,"B4.9"]
[null,null,null,null,null,null,null,null,24.999999999999901,"B5.0"]
[null,null,null,null,null,null,null,null,25.099999999999898,"B5.1"]
[null,null,null,null,null,null,null,null,25.1999999999999,"B5.2"]
[null,null,null,null,null,null,null,null,25.299999999999901,"B5.3"]
[null,null,null,null,null,null,null,null,25.399999999999899,"B5.4"]
[null,null,null,null,null,null,null,null,25.499999999999901,"B5.5"]
[null,null,null,null,null,null,null,null,25.599999999999898,"B5.6"]
[null,null,null,null,null,null,null,null,25.6999999999999,"B5.7"]
[null,null,null,null,null,null,null,null,25.799999999999901,"B5.8"]
[null,null,null,null,null,null,null,null,25.899999999999899,"B5.9"]
[null,null,null,null,null,null,null,null,25.999999999999901,"B6.0"]
[null,null,null,null,null,null,null,null,26.099999999999898,"B6.1"]
[null,null,null,null,null,null,null,null,26.1999999999999,"B6.2"]
[null,null,null,null,null,null,null,null,26.299999999999901,"B6.3"]
[null,null,null,null,null,null,null,null,26.399999999999899,"B6.4"]
[null,null,null,null,null,null,null,null,26.499999999999901,"B6.5"]
[null,null,null,null,null,null,null,null,26.599999999999898,"B6.6"]
[null,null,null,null,null,null,null,null,26.6999999999999,"B6.7"]
[null,null,null,null,null,null,null,null,26.799999999999901,"B6.8"]
[null,null,null,null,null,null,null,null,26.899999999999899,"B6.9"]
[null,null,null,null,null,null,null,null,26.999999999999901,"B7.0"]
[null,null,null,null,null,null,null,null,27.099999999999898,"B7.1"]
[null,null,null,null,null,null,null,null,27.1999999999999,"B7.2"]
[null,null,null,null,null,null,null,null,27.299999999999901,"B7.3"]
[null,null,null,null,null,null,null,null,27.399999999999899,"B7.4"]
[null,null,null,null,null,null,null,null,27.499999999999901,"B7.5"]
[null,null,null,null,null,null,null,null,27.599999999999898,"B7.6"]
[null,null,null,null,null,null,null,null,27.6999999999999,"B7.7"]
[null,null,null,null,null,null,null,null,27.799999999999901,"B7.8"]
[null,null,null,null,null,null,null,null,27.899999999999899,"B7.9"]
[null,null,null,null,null,null,null,null,27.999999999999901,"B8.0"]
[null,null,null,null,null,null,null,null,28.099999999999898,"B8.1"]
[null,null,null,null,null,null,null,null,28.1999999999999,"B8.2"]
[null,null,null,null,null,null,null,null,28.299999999999901,"B8.3"]
[null,null,null,null,null,null,null,null,28.399999999999899,"B8.4"]
[null,null,null,null,null,null,null,null,28.499999999999901,"B8.5"]
[null,null,null,null,null,null,null,null,28.599999999999898,"B8.6"]
[null,null,null,null,null,null,null,null,28.6999999999999,"B8.7"]
[null,null,null,null,null,null,null,null,28.799999999999901,"B8.8"]
[null,null,null,null,null,null,null,null,28.899999999999899,"B8.9"]
[null,null,null,null,null,null,null,null,28.999999999999901,"B9.0"]
[null,null,null,null,null,null,null,null,29.099999999999898,"B9.0"]
[null,null,null,null,null,null,null,null,29.1999999999999,"B9.1"]
[null,null,null,null,null,null,null,null,29.299999999999901,"B9.2"]
[null,null,null,null,null,null,null,null,29.399999999999899,"B9.3"]
[null,null,null,null,null,null,null,null,29.499999999999901,"B9.4"]
[null,null,null,null,null,null,null,null,29.599999999999898,"B9.5"]
[null,null,null,null,null,null,null,null,29.6999999999999,"B9.6"]
[null,null,null,null,null,null,null,null,29.799999999999901,"B9.7"]
[null,null,null,null,null,null,null,null,29.899999999999899,"B9.8"]
[null,null,null,null,null,null,null,null,29.9,"B9.9"]
[null,null,null,null,null,null,null,null,30,"C0.0"]
[null,null,null,null,null,null,null,null,30.1,"C0.1"]
[null,null,null,null,null,null,null,null,30.2,"C0.2"]
[null,null,null,null,null,null,null,null,30.3,"C0.3"]
[null,null,null,null,null,null,null,null,30.4,"C0.4"]
[null,null,null,null,null,null,null,null,30.5,"C0.5"]
[null,null,null,null,null,null,null,null,30.6,"C0.6"]
[null,null,null,null,null,null,null,null,30.7,"C0.7"]
[null,null,null,null,null,null,null,null,30.8,"C0.8"]
[null,null,null,null,null,null,null,null,30.9,"C0.9"]
[null,null,null,null,null,null,null,null,31,"C1.0"]
[null,null,null,null,null,null,null,null,31.1,"C1.1"]
[null,null,null,null,null,null,null,null,31.2,"C1.2"]
[null,null,null,null,null,null,null,null,31.3,"C1.3"]
[null,null,null,null,null,null,null,null,31.4,"C1.4"]
[null,null,null,null,null,null,null,null,31.5,"C1.5"]
[null,null,null,null,null,null,null,null,31.6,"C1.6"]
[null,null,null,null,null,null,null,null,31.7,"C1.7"]
[null,null,null,null,null,null,null,null,31.8,"C1.8"]
[null,null,null,null,null,null,null,null,31.9,"C1.9"]
[null,null,null,null,null,null,null,null,32,"C2.0"]
[null,null,null,null,null,null,null,null,32.1,"C2.1"]
[null,null,null,null,null,null,null,null,32.200000000000003,"C2.2"]
[null,null,null,null,null,null,null,null,32.299999999999997,"C2.3"]
[null,null,null,null,null,null,null,null,32.4,"C2.4"]
[null,null,null,null,null,null,null,null,32.5,"C2.5"]
[null,null,null,null,null,null,null,null,32.6,"C2.6"]
[null,null,null,null,null,null,null,null,32.700000000000003,"C2.7"]
[null,null,null,null,null,null,null,null,32.799999999999997,"C2.8"]
[null,null,null,null,null,null,null,null,32.9,"C2.9"]
[null,null,null,null,null,null,null,null,33,"C3.0"]
[null,null,null,null,null,null,null,null,33.1,"C3.1"]
[null,null,null,null,null,null,null,null,33.200000000000003,"C3.2"]
[null,null,null,null,null,null,null,null,33.299999999999997,"C3.3"]
[null,null,null,null,null,null,null,null,33.4,"C3.4"]
[null,null,null,null,null,null,null,null,33.5,"C3.5"]
[null,null,null,null,null,null,null,null,33.6,"C3.6"]
[null,null,null,null,null,null,null,null,33.700000000000003,"C3.7"]
[null,null,null,null,null,null,null,null,33.799999999999997,"C3.8"]
[null,null,null,null,null,null,null,null,33.9,"C3.9"]
[null,null,null,null,null,null,null,null,34,"C4.0"]
[null,null,null,null,null,null,null,null,34.1,"C4.1"]
[null,null,null,null,null,null,null,null,34.200000000000102,"C4.2"]
[null,null,null,null,null,null,null,null,34.299999999999997,"C4.3"]
[null,null,null,null,null,null,null,null,34.4,"C4.4"]
[null,null,null,null,null,null,null,null,34.5,"C4.5"]
[null,null,null,null,null,null,null,null,34.600000000000101,"C4.6"]
[null,null,null,null,null,null,null,null,34.700000000000102,"C4.7"]
[null,null,null,null,null,null,null,null,34.799999999999997,"C4.8"]
[null,null,null,null,null,null,null,null,34.900000000000098,"C4.9"]
[null,null,null,null,null,null,null,null,35.000000000000099,"C5.0"]
[null,null,null,null,null,null,null,null,35.100000000000101,"C5.1"]
[null,null,null,null,null,null,null,null,35.200000000000102,"C5.2"]
[null,null,null,null,null,null,null,null,35.300000000000097,"C5.3"]
[null,null,null,null,null,null,null,null,35.400000000000098,"C5.4"]
[null,null,null,null,null,null,null,null,35.500000000000099,"C5.5"]
[null,null,null,null,null,null,null,null,35.600000000000101,"C5.6"]
[null,null,null,null,null,null,null,null,35.700000000000102,"C5.7"]
[null,null,null,null,null,null,null,null,35.800000000000097,"C5.8"]
[null,null,null,null,null,null,null,null,35.900000000000098,"C5.9"]
[null,null,null,null,null,null,null,null,36.000000000000099,"C6.0"]
[null,null,null,null,null,null,null,null,36.100000000000101,"C6.1"]
[null,null,null,null,null,null,null,null,36.200000000000102,"C6.2"]
[null,null,null,null,null,null,null,null,36.300000000000097,"C6.3"]
[null,null,null,null,null,null,null,null,36.400000000000098,"C6.4"]
[null,null,null,null,null,null,null,null,36.500000000000099,"C6.5"]
[null,null,null,null,null,null,null,null,36.600000000000101,"C6.6"]
[null,null,null,null,null,null,null,null,36.700000000000102,"C6.7"]
[null,null,null,null,null,null,null,null,36.800000000000097,"C6.8"]
[null,null,null,null,null,null,null,null,36.900000000000098,"C6.9"]
[null,null,null,null,null,null,null,null,37.000000000000099,"C7.0"]
[null,null,null,null,null,null,null,null,37.100000000000101,"C7.1"]
[null,null,null,null,null,null,null,null,37.200000000000102,"C7.2"]
[null,null,null,null,null,null,null,null,37.300000000000097,"C7.3"]
[null,null,null,null,null,null,null,null,37.400000000000098,"C7.4"]
[null,null,null,null,null,null,null,null,37.500000000000099,"C7.5"]
[null,null,null,null,null,null,null,null,37.600000000000101,"C7.6"]
[null,null,null,null,null,null,null,null,37.700000000000102,"C7.7"]
[null,null,null,null,null,null,null,null,37.800000000000097,"C7.8"]
[null,null,null,null,null,null,null,null,37.900000000000098,"C7.9"]
[null,null,null,null,null,null,null,null,38.000000000000099,"C8.0"]
[null,null,null,null,null,null,null,null,38.100000000000101,"C8.1"]
[null,null,null,null,null,null,null,null,38.200000000000102,"C8.2"]
[null,null,null,null,null,null,null,null,38.300000000000097,"C8.3"]
[null,null,null,null,null,null,null,null,38.400000000000098,"C8.4"]
[null,null,null,null,null,null,null,null,38.500000000000099,"C8.5"]
[null,null,null,null,null,null,null,null,38.600000000000101,"C8.6"]
[null,null,null,null,null,null,null,null,38.700000000000102,"C8.7"]
[null,null,null,null,null,null,null,null,38.800000000000097,"C8.8"]
[null,null,null,null,null,null,null,null,38.900000000000098,"C8.9"]
[null,null,null,null,null,null,null,null,39.000000000000099,"C9.0"]
[null,null,null,null,null,null,null,null,39.100000000000101,"C9.1"]
[null,null,null,null,null,null,null,null,39.200000000000102,"C9.2"]
[null,null,null,null,null,null,null,null,39.300000000000097,"C9.3"]
[null,null,null,null,null,null,null,null,39.400000000000098,"C9.4"]
[null,null,null,null,null,null,null,null,39.500000000000099,"C9.5"]
[null,null,null,null,null,null,null,null,39.600000000000101,"C9.6"]
[null,null,null,null,null,null,null,null,39.700000000000102,"C9.7"]
[null,null,null,null,null,null,null,null,39.800000000000097,"C9.8"]
[null,null,null,null,null,null,null,null,39.900000000000098,"C9.9"]
[null,null,null,null,null,null,null,null,40,"D0.0"]
[null,null,null,null,null,null,null,null,40.1,"D0.1"]
[null,null,null,null,null,null,null,null,40.200000000000003,"D0.2"]
[null,null,null,null,null,null,null,null,40.299999999999997,"D0.3"]
[null,null,null,null,null,null,null,null,40.4,"D0.4"]
[null,null,null,null,null,null,null,null,40.5,"D0.5"]
[null,null,null,null,null,null,null,null,40.6,"D0.6"]
[null,null,null,null,null,null,null,null,40.700000000000003,"D0.7"]
[null,null,null,null,null,null,null,null,40.799999999999997,"D0.8"]
[null,null,null,null,null,null,null,null,40.9,"D0.9"]
[null,null,null,null,null,null,null,null,41,"D1.0"]
[null,null,null,null,null,null,null,null,41.1,"D1.1"]
[null,null,null,null,null,null,null,null,41.2,"D1.2"]
[null,null,null,null,null,null,null,null,41.3,"D1.3"]
[null,null,null,null,null,null,null,null,41.4,"D1.4"]
[null,null,null,null,null,null,null,null,41.5,"D1.5"]
[null,null,null,null,null,null,null,null,41.6,"D1.6"]
[null,null,null,null,null,null,null,null,41.7,"D1.7"]
[null,null,null,null,null,null,null,null,41.8,"D1.8"]
[null,null,null,null,null,null,null,null,41.9,"D1.9"]
[null,null,null,null,null,null,null,null,42,"D2.0"]
[null,null,null,null,null,null,null,null,42.1,"D2.1"]
[null,null,null,null,null,null,null,null,42.2,"D2.2"]
[null,null,null,null,null,null,null,null,42.3,"D2.3"]
[null,null,null,null,null,null,null,null,42.4,"D2.4"]
[null,null,null,null,null,null,null,null,42.5,"D2.5"]
[null,null,null,null,null,null,null,null,42.6,"D2.6"]
[null,null,null,null,null,null,null,null,42.7,"D2.7"]
[null,null,null,null,null,null,null,null,42.8,"D2.8"]
[null,null,null,null,null,null,null,null,42.9,"D2.9"]
[null,null,null,null,null,null,null,null,43,"D3.0"]
[null,null,null,null,null,null,null,null,43.1,"D3.1"]
[null,null,null,null,null,null,null,null,43.200000000000102,"D3.2"]
[null,null,null,null,null,null,null,null,43.3,"D3.3"]
[null,null,null,null,null,null,null,null,43.4,"D3.4"]
[null,null,null,null,null,null,null,null,43.5,"D3.5"]
[null,null,null,null,null,null,null,null,43.600000000000101,"D3.6"]
[null,null,null,null,null,null,null,null,43.700000000000102,"D3.7"]
[null,null,null,null,null,null,null,null,43.8,"D3.8"]
[null,null,null,null,null,null,null,null,43.900000000000098,"D3.9"]
[null,null,null,null,null,null,null,null,44.000000000000099,"D4.0"]
[null,null,null,null,null,null,null,null,44.100000000000101,"D4.1"]
[null,null,null,null,null,null,null,null,44.200000000000102,"D4.2"]
[null,null,null,null,null,null,null,null,44.300000000000097,"D4.3"]
[null,null,null,null,null,null,null,null,44.400000000000098,"D4.4"]
[null,null,null,null,null,null,null,null,44.500000000000099,"D4.5"]
[null,null,null,null,null,null,null,null,44.600000000000101,"D4.6"]
[null,null,null,null,null,null,null,null,44.700000000000102,"D4.7"]
[null,null,null,null,null,null,null,null,44.800000000000097,"D4.8"]
[null,null,null,null,null,null,null,null,44.900000000000098,"D4.9"]
[null,null,null,null,null,null,null,null,45.000000000000099,"D5.0"]
[null,null,null,null,null,null,null,null,45.100000000000101,"D5.1"]
[null,null,null,null,null,null,null,null,45.200000000000102,"D5.2"]
[null,null,null,null,null,null,null,null,45.300000000000097,"D5.3"]
[null,null,null,null,null,null,null,null,45.400000000000098,"D5.4"]
[null,null,null,null,null,null,null,null,45.500000000000099,"D5.5"]
[null,null,null,null,null,null,null,null,45.600000000000101,"D5.6"]
[null,null,null,null,null,null,null,null,45.700000000000102,"D5.7"]
[null,null,null,null,null,null,null,null,45.800000000000097,"D5.8"]
[null,null,null,null,null,null,null,null,45.900000000000098,"D5.9"]
[null,null,null,null,null,null,null,null,46.000000000000099,"D6.0"]
[null,null,null,null,null,null,null,null,46.100000000000101,"D6.1"]
[null,null,null,null,null,null,null,null,46.200000000000102,"D6.2"]
[null,null,null,null,null,null,null,null,46.300000000000097,"D6.3"]
[null,null,null,null,null,null,null,null,46.400000000000098,"D6.4"]
[null,null,null,null,null,null,null,null,46.500000000000099,"D6.5"]
[null,null,null,null,null,null,null,null,46.600000000000101,"D6.6"]
[null,null,null,null,null,null,null,null,46.700000000000102,"D6.7"]
[null,null,null,null,null,null,null,null,46.800000000000097,"D6.8"]
[null,null,null,null,null,null,null,null,46.900000000000098,"D6.9"]
[null,null,null,null,null,null,null,null,47.000000000000099,"D7.0"]
[null,null,null,null,null,null,null,null,47.100000000000101,"D7.1"]
[null,null,null,null,null,null,null,null,47.200000000000102,"D7.2"]
[null,null,null,null,null,null,null,null,47.300000000000097,"D7.3"]
[null,null,null,null,null,null,null,null,47.400000000000098,"D7.4"]
[null,null,null,null,null,null,null,null,47.500000000000099,"D7.5"]
[null,null,null,null,null,null,null,null,47.600000000000101,"D7.6"]
[null,null,null,null,null,null,null,null,47.700000000000102,"D7.7"]
[null,null,null,null,null,null,null,null,47.800000000000097,"D7.8"]
[null,null,null,null,null,null,null,null,47.900000000000098,"D7.9"]
[null,null,null,null,null,null,null,null,48.000000000000099,"D8.0"]
[null,null,null,null,null,null,null,null,48.100000000000101,"D8.1"]
[null,null,null,null,null,null,null,null,48.200000000000102,"D8.2"]
[null,null,null,null,null,null,null,null,48.300000000000097,"D8.3"]
[null,null,null,null,null,null,null,null,48.400000000000098,"D8.4"]
[null,null,null,null,null,null,null,null,48.500000000000099,"D8.5"]
[null,null,null,null,null,null,null,null,48.600000000000101,"D8.6"]
[null,null,null,null,null,null,null,null,48.700000000000102,"D8.7"]
[null,null,null,null,null,null,null,null,48.800000000000097,"D8.8"]
[null,null,null,null,null,null,null,null,48.900000000000098,"D8.9"]
[null,null,null,null,null,null,null,null,49.000000000000099,"D9.0"]
[null,null,null,null,null,null,null,null,49.100000000000101,"D9.1"]
[null,null,null,null,null,null,null,null,49.200000000000102,"D9.2"]
[null,null,null,null,null,null,null,null,49.300000000000097,"D9.3"]
[null,null,null,null,null,null,null,null,49.400000000000098,"D9.4"]
[null,null,null,null,null,null,null,null,49.500000000000099,"D9.5"]
[null,null,null,null,null,null,null,null,49.600000000000101,"D9.6"]
[null,null,null,null,null,null,null,null,49.700000000000102,"D9.7"]
[null,null,null,null,null,null,null,null,49.800000000000097,"D9.8"]
[null,null,null,null,null,null,null,null,49.900000000000098,"D9.9"]
[null,null,null,null,null,null,null,null,50.000000000000099,"E0.0"]
[null,null,null,null,null,null,null,null,50.100000000000101,"E0.1"]
[null,null,null,null,null,null,null,null,50.200000000000102,"E0.2"]
[null,null,null,null,null,null,null,null,50.300000000000097,"E0.3"]
[null,null,null,null,null,null,null,null,50.400000000000098,"E0.4"]
[null,null,null,null,null,null,null,null,50.500000000000099,"E0.5"]
[null,null,null,null,null,null,null,null,50.600000000000101,"E0.6"]
[null,null,null,null,null,null,null,null,50.700000000000102,"E0.7"]
[null,null,null,null,null,null,null,null,50.800000000000097,"E0.8"]
[null,null,null,null,null,null,null,null,50.900000000000098,"E0.9"]
[null,null,null,null,null,null,null,null,51.000000000000099,"E1.0"]
[null,null,null,null,null,null,null,null,51.100000000000101,"E1.1"]
[null,null,null,null,null,null,null,null,51.200000000000102,"E1.2"]
[null,null,null,null,null,null,null,null,51.300000000000097,"E1.3"]
[null,null,null,null,null,null,null,null,51.400000000000098,"E1.4"]
[null,null,null,null,null,null,null,null,51.500000000000099,"E1.5"]
[null,null,null,null,null,null,null,null,51.600000000000101,"E1.6"]
[null,null,null,null,null,null,null,null,51.700000000000102,"E1.7"]
[null,null,null,null,null,null,null,null,51.800000000000097,"E1.8"]
[null,null,null,null,null,null,null,null,51.900000000000098,"E1.9"]
[null,null,null,null,null,null,null,null,52.000000000000099,"E2.0"]
[null,null,null,null,null,null,null,null,52.100000000000101,"E2.1"]
[null,null,null,null,null,null,null,null,52.200000000000102,"E2.2"]
[null,null,null,null,null,null,null,null,52.300000000000097,"E2.3"]
[null,null,null,null,null,null,null,null,52.400000000000098,"E2.4"]
[null,null,null,null,null,null,null,null,52.500000000000099,"E2.5"]
[null,null,null,null,null,null,null,null,52.600000000000101,"E2.6"]
[null,null,null,null,null,null,null,null,52.700000000000102,"E2.7"]
[null,null,null,null,null,null,null,null,52.800000000000097,"E2.8"]
[null,null,null,null,null,null,null,null,52.900000000000098,"E2.9"]
[null,null,null,null,null,null,null,null,53.000000000000099,"E3.0"]
[null,null,null,null,null,null,null,null,53.100000000000101,"E3.1"]
[null,null,null,null,null,null,null,null,53.200000000000102,"E3.2"]
[null,null,null,null,null,null,null,null,53.300000000000097,"E3.3"]
[null,null,null,null,null,null,null,null,53.400000000000098,"E3.4"]
[null,null,null,null,null,null,null,null,53.500000000000099,"E3.5"]
[null,null,null,null,null,null,null,null,53.600000000000101,"E3.6"]
[null,null,null,null,null,null,null,null,53.700000000000202,"E3.7"]
[null,null,null,null,null,null,null,null,53.800000000000203,"E3.8"]
[null,null,null,null,null,null,null,null,53.900000000000198,"E3.9"]
[null,null,null,null,null,null,null,null,54.000000000000199,"E4.0"]
[null,null,null,null,null,null,null,null,54.1000000000002,"E4.1"]
[null,null,null,null,null,null,null,null,54.200000000000202,"E4.2"]
[null,null,null,null,null,null,null,null,54.300000000000203,"E4.3"]
[null,null,null,null,null,null,null,null,54.400000000000198,"E4.4"]
[null,null,null,null,null,null,null,null,54.500000000000199,"E4.5"]
[null,null,null,null,null,null,null,null,54.6000000000002,"E4.6"]
[null,null,null,null,null,null,null,null,54.700000000000202,"E4.7"]
[null,null,null,null,null,null,null,null,54.800000000000203,"E4.8"]
[null,null,null,null,null,null,null,null,54.900000000000198,"E4.9"]
[null,null,null,null,null,null,null,null,55.000000000000199,"E5.0"]
[null,null,null,null,null,null,null,null,55.1000000000002,"E5.1"]
[null,null,null,null,null,null,null,null,55.200000000000202,"E5.2"]
[null,null,null,null,null,null,null,null,55.300000000000203,"E5.3"]
[null,null,null,null,null,null,null,null,55.400000000000198,"E5.4"]
[null,null,null,null,null,null,null,null,55.500000000000199,"E5.5"]
[null,null,null,null,null,null,null,null,55.6000000000002,"E5.6"]
[null,null,null,null,null,null,null,null,55.700000000000202,"E5.7"]
[null,null,null,null,null,null,null,null,55.800000000000203,"E5.8"]
[null,null,null,null,null,null,null,null,55.900000000000198,"E5.9"]
[null,null,null,null,null,null,null,null,56.000000000000199,"E6.0"]
[null,null,null,null,null,null,null,null,56.1000000000002,"E6.1"]
[null,null,null,null,null,null,null,null,56.200000000000202,"E6.2"]
[null,null,null,null,null,null,null,null,56.300000000000203,"E6.3"]
[null,null,null,null,null,null,null,null,56.400000000000198,"E6.4"]
[null,null,null,null,null,null,null,null,56.500000000000199,"E6.5"]
[null,null,null,null,null,null,null,null,56.6000000000002,"E6.6"]
[null,null,null,null,null,null,null,null,56.700000000000202,"E6.7"]
[null,null,null,null,null,null,null,null,56.800000000000203,"E6.8"]
[null,null,null,null,null,null,null,null,56.900000000000198,"E6.9"]
[null,null,null,null,null,null,null,null,57.000000000000199,"E7.0"]
[null,null,null,null,null,null,null,null,57.1000000000002,"E7.1"]
[null,null,null,null,null,null,null,null,57.200000000000202,"E7.2"]
[null,null,null,null,null,null,null,null,57.300000000000203,"E7.3"]
[null,null,null,null,null,null,null,null,57.400000000000198,"E7.4"]
[null,null,null,null,null,null,null,null,57.500000000000199,"E7.5"]
[null,null,null,null,null,null,null,null,57.6000000000002,"E7.6"]
[null,null,null,null,null,null,null,null,57.700000000000202,"E7.7"]
[null,null,null,null,null,null,null,null,57.800000000000203,"E7.8"]
[null,null,null,null,null,null,null,null,57.900000000000198,"E7.9"]
[null,null,null,null,null,null,null,null,58.000000000000199,"E8.0"]
[null,null,null,null,null,null,null,null,58.1000000000002,"E8.1"]
[null,null,null,null,null,null,null,null,58.200000000000202,"E8.2"]
[null,null,null,null,null,null,null,null,58.300000000000203,"E8.3"]
[null,null,null,null,null,null,null,null,58.400000000000198,"E8.4"]
[null,null,null,null,null,null,null,null,58.500000000000199,"E8.5"]
[null,null,null,null,null,null,null,null,58.6000000000002,"E8.6"]
[null,null,null,null,null,null,null,null,58.700000000000202,"E8.7"]
[null,null,null,null,null,null,null,null,58.800000000000203,"E8.8"]
[null,null,null,null,null,null,null,null,58.900000000000198,"E8.9"]
[null,null,null,null,null,null,null,null,59.000000000000199,"E9.0"]
[null,null,null,null,null,null,null,null,59.1000000000002,"E9.1"]
[null,null,null,null,null,null,null,null,59.200000000000202,"E9.2"]
[null,null,null,null,null,null,null,null,59.300000000000203,"E9.3"]
[null,null,null,null,null,null,null,null,59.400000000000198,"E9.4"]
[null,null,null,null,null,null,null,null,59.500000000000199,"E9.5"]
[null,null,null,null,null,null,null,null,59.6000000000002,"E9.6"]
[null,null,null,null,null,null,null,null,59.700000000000202,"E9.7"]
[null,null,null,null,null,null,null,null,59.800000000000203,"E9.8"]
[null,null,null,null,null,null,null,null,59.900000000000198,"E9.9"]
[null,null,null,null,null,null,null,null,60.000000000000199,"F0.0"]
[null,null,null,null,null,null,null,null,60.1000000000002,"F0.1"]
[null,null,null,null,null,null,null,null,60.200000000000202,"F0.2"]
[null,null,null,null,null,null,null,null,60.300000000000203,"F0.3"]
[null,null,null,null,null,null,null,null,60.400000000000198,"F0.4"]
[null,null,null,null,null,null,null,null,60.500000000000199,"F0.5"]
[null,null,null,null,null,null,null,null,60.6000000000002,"F0.6"]
[null,null,null,null,null,null,null,null,60.700000000000202,"F0.7"]
[null,null,null,null,null,null,null,null,60.800000000000097,"F0.8"]
[null,null,null,null,null,null,null,null,60.900000000000098,"F0.9"]
[null,null,null,null,null,null,null,null,61.000000000000099,"F1.0"]
[null,null,null,null,null,null,null,null,61.100000000000101,"F1.1"]
[null,null,null,null,null,null,null,null,61.200000000000102,"F1.2"]
[null,null,null,null,null,null,null,null,61.300000000000097,"F1.3"]
[null,null,null,null,null,null,null,null,61.400000000000098,"F1.4"]
[null,null,null,null,null,null,null,null,61.500000000000099,"F1.5"]
[null,null,null,null,null,null,null,null,61.600000000000101,"F1.6"]
[null,null,null,null,null,null,null,null,61.700000000000102,"F1.7"]
[null,null,null,null,null,null,null,null,61.800000000000097,"F1.8"]
[null,null,null,null,null,null,null,null,61.900000000000098,"F1.9"]
[null,null,null,null,null,null,null,null,62.000000000000099,"F2.0"]
[null,null,null,null,null,null,null,null,62.100000000000101,"F2.1"]
[null,null,null,null,null,null,null,null,62.200000000000102,"F2.2"]
[null,null,null,null,null,null,null,null,62.300000000000097,"F2.3"]
[null,null,null,null,null,null,null,null,62.400000000000098,"F2.4"]
[null,null,null,null,null,null,null,null,62.500000000000099,"F2.5"]
[null,null,null,null,null,null,null,null,62.6,"F2.6"]
[null,null,null,null,null,null,null,null,62.7,"F2.7"]
[null,null,null,null,null,null,null,null,62.8,"F2.8"]
[null,null,null,null,null,null,null,null,62.9,"F2.9"]
[null,null,null,null,null,null,null,null,63,"F3.0"]
[null,null,null,null,null,null,null,null,63.1,"F3.1"]
[null,null,null,null,null,null,null,null,63.2,"F3.2"]
[null,null,null,null,null,null,null,null,63.3,"F3.3"]
[null,null,null,null,null,null,null,null,63.4,"F3.4"]
[null,null,null,null,null,null,null,null,63.5,"F3.5"]
[null,null,null,null,null,null,null,null,63.6,"F3.6"]
[null,null,null,null,null,null,null,null,63.7,"F3.7"]
[null,null,null,null,null,null,null,null,63.8,"F3.8"]
[null,null,null,null,null,null,null,null,63.9,"F3.9"]
[null,null,null,null,null,null,null,null,64,"F4.0"]
[null,null,null,null,null,null,null,null,64.099999999999994,"F4.1"]
[null,null,null,null,null,null,null,null,64.2,"F4.2"]
[null,null,null,null,null,null,null,null,64.299999999999898,"F4.3"]
[null,null,null,null,null,null,null,null,64.399999999999906,"F4.4"]
[null,null,null,null,null,null,null,null,64.499999999999901,"F4.5"]
[null,null,null,null,null,null,null,null,64.599999999999895,"F4.6"]
[null,null,null,null,null,null,null,null,64.699999999999903,"F4.7"]
[null,null,null,null,null,null,null,null,64.799999999999898,"F4.8"]
[null,null,null,null,null,null,null,null,64.899999999999906,"F4.9"]
[null,null,null,null,null,null,null,null,64.999999999999901,"F5.0"]
[null,null,null,null,null,null,null,null,65.099999999999895,"F5.1"]
[null,null,null,null,null,null,null,null,65.199999999999903,"F5.2"]
[null,null,null,null,null,null,null,null,65.299999999999898,"F5.3"]
[null,null,null,null,null,null,null,null,65.399999999999906,"F5.4"]
[null,null,null,null,null,null,null,null,65.499999999999901,"F5.5"]
[null,null,null,null,null,null,null,null,65.599999999999895,"F5.6"]
[null,null,null,null,null,null,null,null,65.699999999999903,"F5.7"]
[null,null,null,null,null,null,null,null,65.799999999999898,"F5.8"]
[null,null,null,null,null,null,null,null,65.899999999999807,"F5.9"]
[null,null,null,null,null,null,null,null,65.999999999999901,"F6.0"]
[null,null,null,null,null,null,null,null,66.099999999999795,"F6.1"]
[null,null,null,null,null,null,null,null,66.199999999999804,"F6.2"]
[null,null,null,null,null,null,null,null,66.299999999999798,"F6.3"]
[null,null,null,null,null,null,null,null,66.399999999999807,"F6.4"]
[null,null,null,null,null,null,null,null,66.499999999999801,"F6.5"]
[null,null,null,null,null,null,null,null,66.599999999999795,"F6.6"]
[null,null,null,null,null,null,null,null,66.699999999999804,"F6.7"]
[null,null,null,null,null,null,null,null,66.799999999999798,"F6.8"]
[null,null,null,null,null,null,null,null,66.899999999999807,"F6.9"]
[null,null,null,null,null,null,null,null,66.999999999999801,"F7.0"]
[null,null,null,null,null,null,null,null,67.099999999999795,"F7.1"]
[null,null,null,null,null,null,null,null,67.199999999999804,"F7.2"]
[null,null,null,null,null,null,null,null,67.299999999999798,"F7.3"]
[null,null,null,null,null,null,null,null,67.399999999999807,"F7.4"]
[null,null,null,null,null,null,null,null,67.499999999999801,"F7.5"]
[null,null,null,null,null,null,null,null,67.599999999999795,"F7.6"]
[null,null,null,null,null,null,null,null,67.699999999999704,"F7.7"]
[null,null,null,null,null,null,null,null,67.799999999999798,"F7.8"]
[null,null,null,null,null,null,null,null,67.899999999999693,"F7.9"]
[null,null,null,null,null,null,null,null,67.999999999999702,"F8.0"]
[null,null,null,null,null,null,null,null,68.099999999999696,"F8.1"]
[null,null,null,null,null,null,null,null,68.199999999999704,"F8.2"]
[null,null,null,null,null,null,null,null,68.299999999999699,"F8.3"]
[null,null,null,null,null,null,null,null,68.399999999999693,"F8.4"]
[null,null,null,null,null,null,null,null,68.499999999999702,"F8.5"]
[null,null,null,null,null,null,null,null,68.599999999999696,"F8.6"]
[null,null,null,null,null,null,null,null,68.699999999999704,"F8.7"]
[null,null,null,null,null,null,null,null,68.799999999999699,"F8.8"]
[null,null,null,null,null,null,null,null,68.899999999999693,"F8.9"]
[null,null,null,null,null,null,null,null,68.999999999999702,"F9.0"]
[null,null,null,null,null,null,null,null,69.099999999999696,"F9.1"]
[null,null,null,null,null,null,null,null,69.199999999999704,"F9.2"]
[null,null,null,null,null,null,null,null,69.299999999999699,"F9.3"]
[null,null,null,null,null,null,null,null,69.399999999999693,"F9.4"]
[null,null,null,null,null,null,null,null,69.499999999999702,"F9.5"]
[null,null,null,null,null,null,null,null,69.599999999999596,"F9.6"]
[null,null,null,null,null,null,null,null,69.699999999999605,"F9.7"]
[null,null,null,null,null,null,null,null,69.799999999999599,"F9.8"]
[null,null,null,null,null,null,null,null,69.899999999999594,"F9.9"]
[null,null,null,null,null,null,null,null,69.999999999999602,"G0.0"]
[null,null,null,null,null,null,null,null,70.099999999999596,"G0.1"]
[null,null,null,null,null,null,null,null,70.199999999999605,"G0.2"]
[null,null,null,null,null,null,null,null,70.299999999999599,"G0.3"]
[null,null,null,null,null,null,null,null,70.399999999999594,"G0.4"]
[null,null,null,null,null,null,null,null,70.499999999999602,"G0.5"]
[null,null,null,null,null,null,null,null,70.599999999999596,"G0.6"]
[null,null,null,null,null,null,null,null,70.699999999999505,"G0.7"]
[null,null,null,null,null,null,null,null,70.7999999999995,"G0.8"]
[null,null,null,null,null,null,null,null,70.899999999999494,"G0.9"]
[null,null,null,null,null,null,null,null,70.999999999999503,"G1.0"]
[null,null,null,null,null,null,null,null,71.099999999999497,"G1.1"]
[null,null,null,null,null,null,null,null,71.199999999999505,"G1.2"]
[null,null,null,null,null,null,null,null,71.2999999999995,"G1.3"]
[null,null,null,null,null,null,null,null,71.399999999999494,"G1.4"]
[null,null,null,null,null,null,null,null,71.499999999999503,"G1.5"]
[null,null,null,null,null,null,null,null,71.599999999999497,"G1.6"]
[null,null,null,null,null,null,null,null,71.699999999999505,"G1.7"]
[null,null,null,null,null,null,null,null,71.7999999999995,"G1.8"]
[null,null,null,null,null,null,null,null,71.899999999999494,"G1.9"]
[null,null,null,null,null,null,null,null,71.999999999999503,"G2.0"]
[null,null,null,null,null,null,null,null,72.099999999999497,"G2.1"]
[null,null,null,null,null,null,null,null,72.199999999999505,"G2.2"]
[null,null,null,null,null,null,null,null,72.2999999999995,"G2.3"]
[null,null,null,null,null,null,null,null,72.399999999999494,"G2.4"]
[null,null,null,null,null,null,null,null,72.499999999999403,"G2.5"]
[null,null,null,null,null,null,null,null,72.599999999999397,"G2.6"]
[null,null,null,null,null,null,null,null,72.699999999999406,"G2.7"]
[null,null,null,null,null,null,null,null,72.7999999999994,"G2.8"]
[null,null,null,null,null,null,null,null,72.899999999999395,"G2.9"]
[null,null,null,null,null,null,null,null,72.999999999999403,"G3.0"]
[null,null,null,null,null,null,null,null,73.099999999999397,"G3.1"]
[null,null,null,null,null,null,null,null,73.199999999999406,"G3.2"]
[null,null,null,null,null,null,null,null,73.2999999999994,"G3.3"]
[null,null,null,null,null,null,null,null,73.399999999999395,"G3.4"]
[null,null,null,null,null,null,null,null,73.499999999999403,"G3.5"]
[null,null,null,null,null,null,null,null,73.599999999999397,"G3.6"]
[null,null,null,null,null,null,null,null,73.699999999999406,"G3.7"]
[null,null,null,null,null,null,null,null,73.7999999999994,"G3.8"]
[null,null,null,null,null,null,null,null,73.899999999999395,"G3.9"]
[null,null,null,null,null,null,null,null,73.999999999999403,"G4.0"]
[null,null,null,null,null,null,null,null,74.099999999999397,"G4.1"]
[null,null,null,null,null,null,null,null,74.199999999999307,"G4.2"]
[null,null,null,null,null,null,null,null,74.299999999999301,"G4.3"]
[null,null,null,null,null,null,null,null,74.399999999999295,"G4.4"]
[null,null,null,null,null,null,null,null,74.499999999999304,"G4.5"]
[null,null,null,null,null,null,null,null,74.599999999999298,"G4.6"]
[null,null,null,null,null,null,null,null,74.699999999999307,"G4.7"]
[null,null,null,null,null,null,null,null,74.799999999999301,"G4.8"]
[null,null,null,null,null,null,null,null,74.899999999999295,"G4.9"]
[null,null,null,null,null,null,null,null,74.999999999999304,"G5.0"]
[null,null,null,null,null,null,null,null,75.099999999999298,"G5.1"]
[null,null,null,null,null,null,null,null,75.199999999999307,"G5.2"]
[null,null,null,null,null,null,null,null,75.299999999999301,"G5.3"]
[null,null,null,null,null,null,null,null,75.399999999999295,"G5.4"]
[null,null,null,null,null,null,null,null,75.499999999999304,"G5.5"]
[null,null,null,null,null,null,null,null,75.599999999999298,"G5.6"]
[null,null,null,null,null,null,null,null,75.699999999999307,"G5.7"]
[null,null,null,null,null,null,null,null,75.799999999999301,"G5.8"]
[null,null,null,null,null,null,null,null,75.899999999999295,"G5.9"]
[null,null,null,null,null,null,null,null,75.999999999999204,"G6.0"]
[null,null,null,null,null,null,null,null,76.099999999999199,"G6.1"]
[null,null,null,null,null,null,null,null,76.199999999999207,"G6.2"]
[null,null,null,null,null,null,null,null,76.299999999999201,"G6.3"]
[null,null,null,null,null,null,null,null,76.399999999999196,"G6.4"]
[null,null,null,null,null,null,null,null,76.499999999999204,"G6.5"]
[null,null,null,null,null,null,null,null,76.599999999999199,"G6.6"]
[null,null,null,null,null,null,null,null,76.699999999999207,"G6.7"]
[null,null,null,null,null,null,null,null,76.799999999999201,"G6.8"]
[null,null,null,null,null,null,null,null,76.899999999999196,"G6.9"]
[null,null,null,null,null,null,null,null,76.999999999999204,"G7.0"]
[null,null,null,null,null,null,null,null,77.099999999999199,"G7.1"]
[null,null,null,null,null,null,null,null,77.199999999999207,"G7.2"]
[null,null,null,null,null,null,null,null,77.299999999999201,"G7.3"]
[null,null,null,null,null,null,null,null,77.399999999999196,"G7.4"]
[null,null,null,null,null,null,null,null,77.499999999999204,"G7.5"]
[null,null,null,null,null,null,null,null,77.599999999999199,"G7.6"]
[null,null,null,null,null,null,null,null,77.699999999999207,"G7.7"]
[null,null,null,null,null,null,null,null,77.799999999999102,"G7.8"]
[null,null,null,null,null,null,null,null,77.899999999999096,"G7.9"]
[null,null,null,null,null,null,null,null,77.999999999999105,"G8.0"]
[null,null,null,null,null,null,null,null,78.099999999999099,"G8.1"]
[null,null,null,null,null,null,null,null,78.199999999999093,"G8.2"]
[null,null,null,null,null,null,null,null,78.299999999999102,"G8.3"]
[null,null,null,null,null,null,null,null,78.399999999999096,"G8.4"]
[null,null,null,null,null,null,null,null,78.499999999999105,"G8.5"]
[null,null,null,null,null,null,null,null,78.599999999999099,"G8.6"]
[null,null,null,null,null,null,null,null,78.699999999999093,"G8.7"]
[null,null,null,null,null,null,null,null,78.799999999999102,"G8.8"]
[null,null,null,null,null,null,null,null,78.899999999999096,"G8.9"]
[null,null,null,null,null,null,null,null,78.999999999999105,"G9.0"]
[null,null,null,null,null,null,null,null,79.099999999999099,"G9.1"]
[null,null,null,null,null,null,null,null,79.199999999999093,"G9.2"]
[null,null,null,null,null,null,null,null,79.299999999999102,"G9.3"]
[null,null,null,null,null,null,null,null,79.399999999999096,"G9.4"]
[null,null,null,null,null,null,null,null,79.499999999999005,"G9.5"]
[null,null,null,null,null,null,null,null,79.599999999999,"G9.6"]
[null,null,null,null,null,null,null,null,79.699999999998994,"G9.7"]
[null,null,null,null,null,null,null,null,79.799999999999002,"G9.8"]
[null,null,null,null,null,null,null,null,79.899999999998997,"G9.9"]

{"sheet":"Collection","index":6,"n_rows":124,"n_cols":35,"rows_kept":124,"cut":false,"hidden":true,"merged":[[64,14,64,23],[65,14,65,16],[74,14,74,19],[75,14,75,16],[64,25,64,34],[65,25,65,27],[74,25,74,34],[75,25,75,27],[44,14,44,23],[45,14,45,16],[54,14,54,19],[55,14,55,16],[44,25,44,34],[45,25,45,27],[54,25,54,34],[55,25,55,27],[123,3,123,4],[84,3,84,12],[85,3,85,5],[95,3,95,5],[122,3,122,4],[116,3,116,5],[94,3,94,12],[120,3,120,4],[121,3,121,4],[115,3,115,12],[117,3,117,4],[118,3,118,4],[119,3,119,4],[44,3,44,12],[45,3,45,5],[74,3,74,12],[75,3,75,5],[23,3,23,5],[55,3,55,5],[54,3,54,8],[33,3,33,12],[34,3,34,5],[42,3,42,12],[64,3,64,12],[65,3,65,5],[14,3,14,5],[24,3,24,5],[13,3,13,10],[21,3,21,4],[19,3,19,4],[20,3,20,4],[16,3,16,4],[17,3,17,4],[18,3,18,4],[15,3,15,4]]}
[]
[]
[]
[]
[]
[]
[]
[]
[]
[]
[]
[]
[]
[null,null,null,"USE THE #8 IRON AS JUDGEMENT FOR PLAY L. VS \"STD\" ",null,null,null,null,null,null,null,"VS.STD"]
[null,null,null,"PLAY LENGTH VS STANDARD",null,null,"#3","#4","#5","#6","#7","#8","#9"]
[null,null,null,"SLOPE START CLUB",null,"#3","STD",{"$f":"1/8","v":0.125},{"$f":"H16+1/8","v":0.25},{"$f":"I16+1/8","v":0.375},0.5,0.625,0.75]
[null,null,null,"SLOPE START CLUB",null,"#4",{"$f":"-1/8","v":-0.125},"STD",{"$f":"1/8","v":0.125},{"$f":"I17+1/8","v":0.25},0.375,0.5,0.625]
[null,null,null,"SLOPE START CLUB",null,"#5",{"$f":"G17-1/8","v":-0.25},{"$f":"-1/8","v":-0.125},"STD",{"$f":"1/8","v":0.125},{"$f":"J18+1/8","v":0.25},0.375,0.5]
[null,null,null,"SLOPE START CLUB",null,"#6",{"$f":"G18-1/8","v":-0.375},{"$f":"H18-1/8","v":-0.25},{"$f":"-1/8","v":-0.125},"STD",{"$f":"1/8","v":0.125},{"$f":"K19+1/8","v":0.25},0.375]
[null,null,null,"SLOPE START CLUB",null,"#7",-0.5,-0.375,{"$f":"I19-1/8","v":-0.25},{"$f":"-1/8","v":-0.125},"STD",{"$f":"1/8","v":0.125},{"$f":"L20+1/8","v":0.25}]
[null,null,null,"SLOPE START CLUB",null,"#8",-0.625,-0.5,-0.375,{"$f":"J20-1/8","v":-0.25},{"$f":"-1/8","v":-0.125},"STD",{"$f":"1/8","v":0.125}]
[null,null,null,"SLOPE START CLUB",null,"#9",-0.75,-0.625,-0.5,-0.375,{"$f":"K21-1/8","v":-0.25},{"$f":"-1/8","v":-0.125},"STD"]
[null,null," "]
[null,null," ","STANDARD PLAY LENGTH",null,null,{"$f":"39","v":39},{"$f":"G24-0.5","v":38.5},38,37.5,37,36.5,36]
[null,null," ","NEW PLAY LENGTH AS 3/8\"",null,null,"#3","#4","#5","#6","#7","#8","#9"]
[null,null,null,{"$f":"L16","v":0.625},"VS. STD","#3",{"$f":"G24","v":39},{"$f":"H24+H16","v":38.625},38.25,37.875,37.5,37.125,36.75]
[null,null,null,{"$f":"L17","v":0.5},"VS. STD","#4",{"$f":"G24+G17","v":38.875},{"$f":"H24","v":38.5},{"$f":"I24+I17","v":38.125},{"$f":"J24+J17","v":37.75},{"$f":"K24+K17","v":37.375},{"$f":"L24+L17","v":37},{"$f":"M24+M17","v":36.625}]
[null,null,null,0.375,"VS. STD","#5",{"$f":"G24+G18","v":38.75},{"$f":"H24+H18","v":38.375},{"$f":"I24","v":38},{"$f":"J24+J18","v":37.625},{"$f":"K24+K18","v":37.25},{"$f":"L24+L18","v":36.875},{"$f":"M24+M18","v":36.5}]
[null,null,null,0.25,"VS. STD","#6",{"$f":"G24+G19","v":38.625},{"$f":"H24+H19","v":38.25},{"$f":"I24+I19","v":37.875},{"$f":"J24","v":37.5},{"$f":"K24+K19","v":37.125},{"$f":"L24+L19","v":36.75},{"$f":"M24+M19","v":36.375}]
[null,null,null,0.125,"VS. STD","#7",{"$f":"G24+G20","v":38.5},{"$f":"H24+H20","v":38.125},{"$f":"I24+I20","v":37.75},{"$f":"J24+J20","v":37.375},{"$f":"K24","v":37},{"$f":"L24+L20","v":36.625},{"$f":"M24+M20","v":36.25}]
[null,null,null,"STD","VS. STD","#8",{"$f":"G24+G21","v":38.375},{"$f":"H24+H21","v":38},{"$f":"I24+I21","v":37.625},{"$f":"J24+J21","v":37.25},{"$f":"K24+K21","v":36.875},{"$f":"L24","v":36.5},{"$f":"M24+M21","v":36.125}]
[null,null,null,-0.125,"VS. STD","#9",{"$f":"G24+G22","v":38.25},37.875,37.5,37.125,36.75,36.375,{"$f":"M24","v":36}]
[]
[null,null,null,"MINUMUM SW VALUES TO AVOID WEIGHT REMOVAL - D2 CONSIDERED AS STANDARD"]
[null,null,null,"LOWEST SW VALUES POSSIBLE",null,null,"#3","#4","#5","#6","#7","#8","#9"]
[null,null,null,{"$f":"D26","v":0.625},"VS. STD","#3","D3.5","D4.0","D4.5","D5","D5.5","D6","D6.5"]
[null,null,null,{"$f":"D27","v":0.5},"VS. STD","#4","D2.8","D3.3","D3.8","D4.3","D4.8","D5.3","D5.8"]
[null,null,null,0.375,"VS. STD","#5","D2","D2.5","D3","D3.5","D4","D4.5","D5"]
[null,null,null,0.25,"VS. STD","#6","D1.3","D1.8","D2.3","D2.8","D3.3","D3.8","D4.3"]
[null,null,null,0.125,"VS. STD","#7","D0.5","D1","D1.5","D2","D2.5","D3","D3.5"]
[null,null,null,{"$f":"D31","v":"STD"},"VS. STD","#8","C9.8","D0.3","D0.8","D1.3","D1.8","D2.3","D2.8"]
[null,null,null,-0.125,"VS. STD","#9","C9","C9.5","D0","D0.5","D1","D1.5","D2"]
[null,null,null,"ALL VALUES VS D2 AS STD - IF YOUSTART FROM D1 SUBTRACKT 1 SWP (D3=D2) AND VICE VERSA"]
[]
[null,null,null,"GRAMS TO ADD",null,null,null,null,null,null,null,null,null,null,"GRAMS TO ADD",null,null,null,null,null,null,null,null,null,null,"BWGT OFF BY USE OF FLATT WGT ADDED"]
[null,null,null,"GRAMS TO ADD",null,null,"#3","#4","#5","#6","#7","#8","#9",null,"GRAMS TO ADD",null,null,"#3","#4","#5","#6","#7","#8","#9",null,"GRAMS TO ADD",null,null,"#3","#4","#5","#6","#7","#8","#9"]
[null,null,null,{"$f":"D36","v":0.625},"VS. STD","#3",{"$f":"G67*G97","v":2.9849999999999999},2.5249999999999999,2.0499999999999998,1.56,1.0549999999999999,0.53749999999999998,0,null,{"$f":"O36","v":0},"VS. STD","#3",3,2.5,2,1.5,1,0.5,0,null,{"$f":"Z36","v":0},"VS. STD","#3",{"$f":"R47-G47","v":1.5000000000000124E-2},{"$f":"S47-H47","v":-2.4999999999999911E-2},-4.9999999999999822E-2,-6.0000000000000053E-2,-5.4999999999999938E-2,-3.7499999999999978E-2,0]
[null,null,null,{"$f":"D37","v":0.5},"VS. STD","#4",3.0999999999999996,2.6389999999999993,2.1629999999999998,1.6719999999999995,1.1659999999999997,0.65099999999999958,0.10999999999999961,null,{"$f":"O37","v":0},"VS. STD","#4",{"$f":"R47","v":3},{"$f":"S47","v":2.5},{"$f":"T47","v":2},{"$f":"U47","v":1.5},{"$f":"V47","v":1},{"$f":"W47","v":0.5},{"$f":"X47","v":0},null,{"$f":"Z37","v":0},"VS. STD","#4",{"$f":"R48-G48","v":-9.9999999999999645E-2},{"$f":"S48-H48","v":-0.13899999999999935},{"$f":"T48-I48","v":-0.16299999999999981},{"$f":"U48-J48","v":-0.17199999999999949},{"$f":"V48-K48","v":-0.1659999999999997},{"$f":"W48-L48","v":-0.15099999999999958},{"$f":"X48-M48","v":-0.10999999999999961}]
[null,null,null,0.375,"VS. STD","#5",3.0149999999999997,2.5499999999999998,2.0699999999999998,1.5750000000000002,1.07,0.54500000000000004,0,null,0,"VS. STD","#5",3,2.5,2,1.5,1,0.5,0,null,0,"VS. STD","#5",-1.499999999999968E-2,-4.9999999999999822E-2,-6.999999999999984E-2,-7.5000000000000178E-2,-7.0000000000000062E-2,-4.500000000000004E-2,0]
[null,null,null,0.25,"VS. STD","#6",3.1310000000000002,2.665,2.1839999999999997,1.6879999999999995,1.1824999999999997,0.65699999999999958,0.11099999999999961,null,0,"VS. STD","#6",3,2.5,2,1.5,1,0.5,0,null,0,"VS. STD","#6",-0.13100000000000023,-0.16500000000000004,-0.18399999999999972,-0.1879999999999995,-0.18249999999999966,-0.15699999999999958,-0.11099999999999961]
[null,null,null,0.125,"VS. STD","#7",3.0449999999999999,2.5750000000000002,2.09,1.59,1.085,0.55000000000000004,0,null,0,"VS. STD","#7",3,2.5,2,1.5,1,0.5,0,null,0,"VS. STD","#7",-4.4999999999999929E-2,-7.5000000000000178E-2,-8.9999999999999858E-2,-9.000000000000008E-2,-8.4999999999999964E-2,-5.0000000000000044E-2,0]
[null,null,null,"STD","VS. STD","#8",3.1620000000000004,2.6909999999999998,2.2050000000000001,1.7120000000000002,1.1990000000000003,0.66299999999999959,0.11199999999999961,null,0,"VS. STD","#8",3,2.5,2,1.5,1,0.5,0,null,0,"VS. STD","#8",-0.16200000000000037,-0.19099999999999984,-0.20500000000000007,-0.21200000000000019,-0.19900000000000029,-0.16299999999999959,-0.11199999999999961]
[null,null,null,-0.125,"VS. STD","#9",3.0749999999999997,2.6,2.11,1.6124999999999998,1.095,0.55500000000000005,0,null,0,"VS. STD","#9",3,2.5,2,1.5,1,0.5,0,null,0,"VS. STD","#9",-7.4999999999999734E-2,-0.10000000000000009,-0.10999999999999988,-0.11249999999999982,-9.4999999999999973E-2,-5.5000000000000049E-2,0]
[]
[null,null,null,"LEAD TAPE AS CENTIMETER",null,null,null,null,null,null,null,"CM to Gram",3.81,null,"LEAD TAPE AS CENTIMETER",null,null,null,null,null,null,null,"CM to Gram",3.81,null,"SWP OFF TARGET BY USINFG AVERAGE FLAT WGT"]
[null,null,null,"CM LEAD TAPE 1/2\" WIDE",null,null,"#3","#4","#5","#6","#7","#8","#9",null,"CM LEAD TAPE 1/2\" WIDE",null,null,"#3","#4","#5","#6","#7","#8","#9",null,"GRAMS TO ADD",null,null,"#3","#4","#5","#6","#7","#8","#9"]
[null,null,null,{"$f":"D47","v":0.625},"VS. STD","#3",{"$f":"$M$55*G47","v":11.37285},{"$f":"$M$55*H47","v":9.6202500000000004},7.8104999999999993,5.9436,4.0195499999999997,2.0478749999999999,0,null,{"$f":"O47","v":0},"VS. STD","#3",{"$f":"$M$55*R47","v":11.43},{"$f":"$M$55*S47","v":9.5250000000000004},7.62,5.7149999999999999,3.81,1.905,0,null,null,"VS. STD","#3",{"$f":"AC47/G67","v":7.5376884422111174E-3},{"$f":"AD47/H67","v":-1.2376237623762332E-2},-2.4390243902438939E-2,-2.8846153846153872E-2,-2.6066350710900445E-2,-1.7441860465116268E-2,0]
[null,null,null,{"$f":"D48","v":0.5},"VS. STD","#4",{"$f":"$M$55*G48","v":11.810999999999998},10.054589999999997,8.2410299999999985,6.3703199999999978,4.4424599999999987,2.4803099999999985,0.41909999999999853,null,{"$f":"O48","v":0},"VS. STD","#4",{"$f":"$M$55*R48","v":11.43},9.5250000000000004,7.62,5.7149999999999999,3.81,1.905,0,null,{"$f":"Z47","v":0},"VS. STD","#4",{"$f":"AC48/G68","v":-4.9999999999999822E-2},{"$f":"AD48/H68","v":-6.8472906403940575E-2},{"$f":"AE48/I68","v":-7.9126213592232916E-2},{"$f":"AF48/J68","v":-8.2296650717703104E-2},{"$f":"AG48/K68","v":-7.8301886792452688E-2},{"$f":"AH48/L68","v":-6.9585253456221005E-2},{"$f":"AI48/M68","v":-4.9999999999999822E-2}]
[null,null,null,0.375,"VS. STD","#5",{"$f":"$M$55*G49","v":11.48715},9.7154999999999987,7.8866999999999994,6.0007500000000009,4.0767000000000007,2.0764500000000004,0,null,0,"VS. STD","#5",{"$f":"$M$55*R49","v":11.43},9.5250000000000004,7.62,5.7149999999999999,3.81,1.905,0,null,0,"VS. STD","#5",-7.4626865671640211E-3,-2.450980392156854E-2,-3.3816425120772875E-2,-3.5714285714285796E-2,-3.27102803738318E-2,-2.0642201834862404E-2,0]
[null,null,null,0.25,"VS. STD","#6",{"$f":"$M$55*G50","v":11.929110000000001},10.153650000000001,8.3210399999999982,6.4312799999999983,4.5053249999999991,2.5031699999999986,0.42290999999999851,null,0,"VS. STD","#6",{"$f":"$M$55*R50","v":11.43},9.5250000000000004,7.62,5.7149999999999999,3.81,1.905,0,null,0,"VS. STD","#6",-6.4851485148514965E-2,-8.048780487804881E-2,-8.8461538461538328E-2,-8.9099526066350479E-2,-8.4883720930232401E-2,-7.1689497716894784E-2,-4.9999999999999822E-2]
[null,null,null,0.125,"VS. STD","#7",{"$f":"$M$55*G51","v":11.60145},9.8107500000000005,7.9628999999999994,6.0579000000000001,4.1338499999999998,2.0955000000000004,0,null,0,"VS. STD","#7",{"$f":"$M$55*R51","v":11.43},9.5250000000000004,7.62,5.7149999999999999,3.81,1.905,0,null,0,"VS. STD","#7",-2.216748768472903E-2,-3.640776699029135E-2,-4.3062200956937732E-2,-4.2452830188679277E-2,-3.9170506912442379E-2,-2.2727272727272745E-2,0]
[null,null,null,"STD","VS. STD","#8",{"$f":"$M$55*G52","v":12.047220000000001},10.252709999999999,8.4010499999999997,6.5227200000000005,4.5681900000000013,2.5260299999999987,0.42671999999999854,null,0,"VS. STD","#8",{"$f":"$M$55*R52","v":11.43},9.5250000000000004,7.62,5.7149999999999999,3.81,1.905,0,null,0,"VS. STD","#8",-7.9411764705882529E-2,-9.227053140096611E-2,-9.7619047619047647E-2,-9.9065420560747741E-2,-9.1284403669724901E-2,-7.3755656108597106E-2,-4.9999999999999822E-2]
[null,null,null,-0.125,"VS. STD","#9",{"$f":"$M$55*G53","v":11.71575},9.9060000000000006,8.0390999999999995,6.1436249999999992,4.1719499999999998,2.1145500000000004,0,null,0,"VS. STD","#9",{"$f":"$M$55*R53","v":11.43},9.5250000000000004,7.62,5.7149999999999999,3.81,1.905,0,null,0,"VS. STD","#9",-3.6585365853658409E-2,-4.8076923076923121E-2,-5.2132701421800889E-2,-5.2325581395348757E-2,-4.3378995433789945E-2,-2.4774774774774796E-2,0]
[]
[null,null,null,"GRAMS PR SWINGWEIGHT POINT FOR REFERENNCE - RELATIVE TO NEW PLAY LENGHTS AS 3/8\"",null,null,null,null,null,null,null,null,null,null,"GRAMS TO ADD",null,null,null,null,null,null,null,null,null,null,"BWGT OFF BY USE OF FLATT WGT ADDED"]
[null,null,null," 1 SWING W.POINT = GRAMS",null,null,"#3","#4","#5","#6","#7","#8","#9",null,"GRAMS TO ADD",null,null,"#3","#4","#5","#6","#7","#8","#9",null,"GRAMS TO ADD",null,null,"#3","#4","#5","#6","#7","#8","#9"]
[null,null,null,{"$f":"D57","v":0.625},"VS. STD","#3",1.99,2.02,2.0499999999999998,2.08,2.11,2.15,2.19,null,{"$f":"O56","v":"CM LEAD TAPE 1/2\" WIDE"},"VS. STD","#3",3,2.5,2,1.5,1,0.52,{"$f":"X87*X117","v":0},null,{"$f":"Z56","v":"GRAMS TO ADD"},"VS. STD","#3",{"$f":"R67-G47","v":1.5000000000000124E-2},{"$f":"S67-H47","v":-2.4999999999999911E-2},-4.9999999999999822E-2,-6.0000000000000053E-2,-5.4999999999999938E-2,-1.749999999999996E-2,0]
[null,null,null,{"$f":"D58","v":0.5},"VS. STD","#4",2,2.0299999999999998,2.06,2.09,2.12,2.17,2.2000000000000002,null,{"$f":"O57","v":0},"VS. STD","#4",{"$f":"R67","v":3},{"$f":"S67","v":2.5},{"$f":"T67","v":2},{"$f":"U67","v":1.5},{"$f":"V67","v":1},{"$f":"W67","v":0.52},{"$f":"X67","v":0},null,{"$f":"Z57","v":0},"VS. STD","#4",{"$f":"R68-G48","v":-9.9999999999999645E-2},{"$f":"S68-H48","v":-0.13899999999999935},{"$f":"T68-I48","v":-0.16299999999999981},{"$f":"U68-J48","v":-0.17199999999999949},{"$f":"V68-K48","v":-0.1659999999999997},{"$f":"W68-L48","v":-0.13099999999999956},{"$f":"X68-M48","v":-0.10999999999999961}]
[null,null,null,0.375,"VS. STD","#5",2.0099999999999998,2.04,2.0699999999999998,2.1,2.14,2.1800000000000002,2.21,null,0,"VS. STD","#5",3,2.5,2,1.5,1,0.52,0,null,0,"VS. STD","#5",-1.499999999999968E-2,-4.9999999999999822E-2,-6.999999999999984E-2,-7.5000000000000178E-2,-7.0000000000000062E-2,-2.5000000000000022E-2,0]
[null,null,null,0.25,"VS. STD","#6",2.02,2.0499999999999998,2.08,2.11,2.15,2.19,2.2200000000000002,null,0,"VS. STD","#6",3,2.5,2,1.5,1,0.52,0,null,0,"VS. STD","#6",-0.13100000000000023,-0.16500000000000004,-0.18399999999999972,-0.1879999999999995,-0.18249999999999966,-0.13699999999999957,-0.11099999999999961]
[null,null,null,0.125,"VS. STD","#7",2.0299999999999998,2.06,2.09,2.12,2.17,2.2000000000000002,2.23,null,0,"VS. STD","#7",3,2.5,2,1.5,1,0.52,0,null,0,"VS. STD","#7",-4.4999999999999929E-2,-7.5000000000000178E-2,-8.9999999999999858E-2,-9.000000000000008E-2,-8.4999999999999964E-2,-3.0000000000000027E-2,0]
[null,null,null,"STD","VS. STD","#8",2.04,2.0699999999999998,2.1,2.14,2.1800000000000002,2.21,2.2400000000000002,null,0,"VS. STD","#8",3,2.5,2,1.5,1,0.52,0,null,0,"VS. STD","#8",-0.16200000000000037,-0.19099999999999984,-0.20500000000000007,-0.21200000000000019,-0.19900000000000029,-0.14299999999999957,-0.11199999999999961]
[null,null,null,-0.125,"VS. STD","#9",2.0499999999999998,2.08,2.11,2.15,2.19,2.2200000000000002,2.2599999999999998,null,0,"VS. STD","#9",3,2.5,2,1.5,1,0.52,0,null,0,"VS. STD","#9",-7.4999999999999734E-2,-0.10000000000000009,-0.10999999999999988,-0.11249999999999982,-9.4999999999999973E-2,-3.5000000000000031E-2,0]
[]
[null,null,null,"SWP CHANGE DUE TO GOING 3/8\"",null,null,null,null,null,null,null,null,null,null,"LEAD TAPE AS INCH",null,null,null,null,null,null,null,"CM to Gram",3.81,null,"SWP OFF TARGET BY USINFG AVERAGE FLAT WGT"]
[null,null,null,"SWP CHANGE.",null,null,"#3","#4","#5","#6","#7","#8","#9",null,"CM LEAD TAPE 1/2\" WIDE",null,null,"#3","#4","#5","#6","#7","#8","#9",null,"GRAMS TO ADD",null,null,"#3","#4","#5","#6","#7","#8","#9"]
[null,null,null,{"$f":"D67","v":0.625},"VS. STD","#3",{"$f":"6*0","v":0},{"$f":"6*$H16","v":0.75},{"$f":"6*$I16","v":1.5},{"$f":"6*$J16","v":2.25},{"$f":"6*$K16","v":3},{"$f":"6*$L16","v":3.75},{"$f":"6*$M16","v":4.5},null,{"$f":"O67","v":"CM LEAD TAPE 1/2\" WIDE"},"VS. STD","#3",{"$f":"R67/3","v":1},0.83333333333333337,0.66666666666666663,0.5,0.33333333333333331,0.17333333333333334,{"$f":"$M$55*X67","v":0},null,null,"VS. STD","#3",{"$f":"AC67/G67","v":7.5376884422111174E-3},{"$f":"AD67/H67","v":-1.2376237623762332E-2},-2.4390243902438939E-2,-2.8846153846153872E-2,-2.6066350710900445E-2,-8.1395348837209128E-3,0]
[null,null,null,{"$f":"D68","v":0.5},"VS. STD","#4",{"$f":"6*$H18","v":-0.75},0,{"$f":"6*$I17","v":0.75},{"$f":"6*$J17","v":1.5},{"$f":"6*$K17","v":2.25},{"$f":"6*$L17","v":3},3.75,null,{"$f":"O68","v":0},"VS. STD","#4",{"$f":"R68/3","v":1},0.83333333333333337,0.66666666666666663,0.5,0.33333333333333331,0.17333333333333334,0,null,{"$f":"Z67","v":"GRAMS TO ADD"},"VS. STD","#4",{"$f":"AC68/G68","v":-4.9999999999999822E-2},{"$f":"AD68/H68","v":-6.8472906403940575E-2},{"$f":"AE68/I68","v":-7.9126213592232916E-2},{"$f":"AF68/J68","v":-8.2296650717703104E-2},{"$f":"AG68/K68","v":-7.8301886792452688E-2},{"$f":"AH68/L68","v":-6.0368663594469844E-2},{"$f":"AI68/M68","v":-4.9999999999999822E-2}]
[null,null,null,0.375,"VS. STD","#5",{"$f":"6*$H19","v":-1.5},{"$f":"6*$H18","v":-0.75},0,0.75,1.5,2.25,3,null,0,"VS. STD","#5",{"$f":"R69/3","v":1},0.83333333333333337,0.66666666666666663,0.5,0.33333333333333331,0.17333333333333334,0,null,0,"VS. STD","#5",-7.4626865671640211E-3,-2.450980392156854E-2,-3.3816425120772875E-2,-3.5714285714285796E-2,-3.27102803738318E-2,-1.146788990825689E-2,0]
[null,null,null,0.25,"VS. STD","#6",{"$f":"6*$H20","v":-2.25},{"$f":"6*$H19","v":-1.5},-0.75,0,0.75,1.5,2.25,null,0,"VS. STD","#6",{"$f":"R70/3","v":1},0.83333333333333337,0.66666666666666663,0.5,0.33333333333333331,0.17333333333333334,0,null,0,"VS. STD","#6",-6.4851485148514965E-2,-8.048780487804881E-2,-8.8461538461538328E-2,-8.9099526066350479E-2,-8.4883720930232401E-2,-6.2557077625570584E-2,-4.9999999999999822E-2]
[null,null,null,0.125,"VS. STD","#7",{"$f":"6*$H21","v":-3},{"$f":"6*$H20","v":-2.25},-1.5,-0.75,0,0.75,1.5,null,0,"VS. STD","#7",{"$f":"R71/3","v":1},0.83333333333333337,0.66666666666666663,0.5,0.33333333333333331,0.17333333333333334,0,null,0,"VS. STD","#7",-2.216748768472903E-2,-3.640776699029135E-2,-4.3062200956937732E-2,-4.2452830188679277E-2,-3.9170506912442379E-2,-1.3636363636363648E-2,0]
[null,null,null,"STD","VS. STD","#8",{"$f":"6*$H22","v":-3.75},{"$f":"6*$H21","v":-3},-2.25,-1.5,-0.75,0,0.75,null,0,"VS. STD","#8",{"$f":"R72/3","v":1},0.83333333333333337,0.66666666666666663,0.5,0.33333333333333331,0.17333333333333334,0,null,0,"VS. STD","#8",-7.9411764705882529E-2,-9.227053140096611E-2,-9.7619047619047647E-2,-9.9065420560747741E-2,-9.1284403669724901E-2,-6.4705882352940988E-2,-4.9999999999999822E-2]
[null,null,null,-0.125,"VS. STD","#9",{"$f":"6*$G22","v":-4.5},{"$f":"6*$H22","v":-3.75},-3,-2.25,-1.5,-0.75,0,null,0,"VS. STD","#9",{"$f":"R73/3","v":1},0.83333333333333337,0.66666666666666663,0.5,0.33333333333333331,0.17333333333333334,0,null,0,"VS. STD","#9",-3.6585365853658409E-2,-4.8076923076923121E-2,-5.2132701421800889E-2,-5.2325581395348757E-2,-4.3378995433789945E-2,-1.5765765765765778E-2,0]
[]
[null,null,null,"TARGET SW"]
[null,null,null,"LOWEST TARGET SW",null,null,"#3","#4","#5","#6","#7","#8","#9"]
[null,null,null,{"$f":"D77","v":0.625},"VS. STD","#3",3.5,4,4.5,5,5.5,6,6.5]
[null,null,null,{"$f":"D78","v":0.5},"VS. STD","#4",2.8,3.3,3.8,4.3,4.8,5.3,5.8]
[null,null,null,0.375,"VS. STD","#5",2,2.5,3,3.5,4,4.5,5]
[null,null,null,0.25,"VS. STD","#6",1.3,1.8,2.2999999999999998,2.8,3.3,3.8,4.3]
[null,null,null,0.125,"VS. STD","#7",0.5,1,1.5,2,2.5,3,3.5]
[null,null,null,"STD","VS. STD","#8",{"$f":"H92-0.5","v":-0.2},0.3,0.8,1.3,1.8,2.2999999999999998,2.8]
[null,null,null,-0.125,"VS. STD","#9",{"$f":"H93-0.5","v":-1},{"$f":"I93-0.5","v":-0.5},0,0.5,1,1.5,2]
[]
[null,null,null,"POINT TO COMPENSATE "]
[null,null,null,"SW POINT TOTAL TO ADJUST",null,null,"#3","#4","#5","#6","#7","#8","#9"]
[null,null,null,{"$f":"D87","v":0.625},"VS. STD","#3",{"$f":"G87-(G77+2)","v":1.5},1.25,1,0.75,0.5,0.25,{"$f":"M87-(M77+2)","v":0}]
[null,null,null,{"$f":"D88","v":0.5},"VS. STD","#4",{"$f":"G88-(G78+2)","v":1.5499999999999998},1.2999999999999998,1.0499999999999998,0.79999999999999982,0.54999999999999982,0.29999999999999982,4.9999999999999822E-2]
[null,null,null,0.375,"VS. STD","#5",{"$f":"G89-(G79+2)","v":1.5},1.25,1,0.75,0.5,0.25,0]
[null,null,null,0.25,"VS. STD","#6",{"$f":"G90-(G80+2)","v":1.55},1.3,1.0499999999999998,0.79999999999999982,0.54999999999999982,0.29999999999999982,4.9999999999999822E-2]
[null,null,null,0.125,"VS. STD","#7",{"$f":"G91-(G81+2)","v":1.5},1.25,1,0.75,0.5,0.25,0]
[null,null,null,"STD","VS. STD","#8",{"$f":"G92-(G82+2)","v":1.55},1.3,1.05,0.8,0.55000000000000004,0.29999999999999982,4.9999999999999822E-2]
[null,null,null,-0.125,"VS. STD","#9",{"$f":"G93-(G83+2)","v":1.5},1.25,1,0.75,0.5,0.25,0]
[]
[]
[]
[]
[]
[]
[]
[]
[]
[]
[]
[]
[null,null,null,"LEAD TAPE GRAMS TO PROGRESSIVE SWING WEIGHT SLOPE OF 0.5 SWP BOTH WAYS FROM THE START CLUB"]
[null,null,null," 1 SWING W.POINT = GRAMS",null,null,"#3","#4","#5","#6","#7","#8","#9"]
[null,null,null,"SLOPE START CLUB",null,"#3",0,-0.5,-1,-1.6,-2.1,-2.7,-3.3,{"$f":"-$M118/2.19","v":1.5068493150684932}]
[null,null,null,"SLOPE START CLUB",null,"#4",0.5,0,-0.5,-1,-1.6,-2.2000000000000002,-2.8,1.2785388127853881]
[null,null,null,"SLOPE START CLUB",null,"#5",4.1666666666666664E-2,0.5,0,-0.5,-1.1000000000000001,-1.6,-2.2000000000000002,1.0045662100456623]
[null,null,null,"SLOPE START CLUB",null,"#6",1.5,1,0.5,0,-0.5,-1.1000000000000001,-1.7,0.77625570776255703]
[null,null,null,"SLOPE START CLUB",null,"#7",2,1.5,1,0.5,0,-0.6,-1.1000000000000001,0.50228310502283113]
[null,null,null,"SLOPE START CLUB",null,"#8",2.6,2.1,1.6,1.1000000000000001,0.5,0,-0.6,0.27397260273972601]
[null,null,null,"SLOPE START CLUB",null,"#9",3.1,2.6,2.1,1.6,1.1000000000000001,0.6,0,0]

{"sheet":"Sheet2","index":7,"n_rows":11,"n_cols":9,"rows_kept":11,"cut":false,"hidden":true,"merged":[[1,1,2,6],[2,8,2,13],[10,8,10,13],[18,1,18,6],[17,8,18,13]]}
[]
[null,"FITTING"]
[null,null,null,null,null,null,null,null,"WORK SHOP"]
[]
[]
[]
[]
[]
[]
[]
[null,null,null,null,null,null,null,null,"HEAD WEIGHT ADJUSTMENT"]